{"text_format":"1","workbook":"xlsx","n_sheets":3,"sheets":["K","E","T"],"not_rendered":{"charts":6,"images":0,"macros":0,"external_links":0,"defined_names":0,"comments":0,"pivot_tables":0},"unopened":[],"bounds":{"document_bytes":16777216,"sheet_cells":100000,"rows_first":2000,"rows_last":500,"rows_between":2000,"halvings":0,"cell_chars":16384,"cell_head_chars":4096},"cells_cut":0,"cells_raw":0,"read":"whole","date_system":"1900"}

{"sheet":"K","index":0,"n_rows":290,"n_cols":8,"rows_kept":290,"cut":false,"hidden":false,"merged":[[56,0,56,3],[84,0,84,4],[86,0,86,4],[5,0,5,6],[79,0,79,4],[80,0,80,4],[81,0,81,4],[82,0,82,4],[83,0,83,4],[73,0,73,4],[74,0,74,4],[77,0,77,4],[78,0,78,4],[65,0,65,3],[66,0,66,3],[67,0,67,3],[68,0,68,3],[72,0,72,4],[57,0,57,3],[61,0,61,3],[62,0,62,3],[63,0,63,3],[64,0,64,3],[51,0,51,3],[52,0,52,3],[53,0,53,3],[54,0,54,3],[55,0,55,3],[46,0,46,3],[47,0,47,3],[48,0,48,3],[49,0,49,3],[50,0,50,3],[36,0,36,4],[38,0,38,4],[43,0,43,3],[44,0,44,3],[45,0,45,3],[28,0,28,4],[29,0,29,4],[30,0,30,4],[31,0,31,4],[34,0,34,4],[289,0,289,5],[3,0,3,6],[9,0,9,4],[10,0,10,4],[11,0,11,4],[12,0,12,4],[13,0,13,4],[16,0,16,4],[17,0,17,4],[18,0,18,4],[19,0,19,4],[21,0,21,4],[22,0,22,4],[23,0,23,4],[20,0,20,4],[27,0,27,4]]}
[]
["ALOITTAVAN RATSASTUSKOULUN TILINPÄÄTÖSTEN ENNAKOINTI VIIDELLE VUODELLE"]
[]
["Tällä laskentamallilla voit helposti laatia perustettavalle uudelle ratsastuskoulullesi alustavan taloudellisen laskelman viiden ensimmäisen vuoden toiminnasta.   Ratsastuskoulun lisäksi sinulla on mahdollisuus sisällyttää laskelmiin täysihoitoon otettuja hevosia. Syötä laskentaa varten malliin ensin tiedot ratsastuskoululle hankittavasta omaisuudesta, yrityksesi veroprosentista, otettavien velkojen korosta ja velka-ajan pituudesta, sinun voitto-osuudestasi, rahoitusomaisuuden riittävästä määrästä sekä arvioi liikevaihdon ja kiinteiden kulujen kasvuprosentit. Syötä tämän jälkeen yrityksesi ensimmäiselle toimintavuodelle ennakoimasi tulot ja kulut, investoinnit ja rahoitus. Tässä laskentamallissa ei oteta huomioon arvonlisäveroa."]
[]
["Taulukossa on valmiina esimerkkinä kuvitteellisen ratsastuskoulun luvut. Tässä omissa tiloissa toimivassa ratsastuskoulussa on opetuskäytössä 10 hevosta, jonka lisäksi tallilla on 5 hevosta täysihoidossa. Ratsastuskoulu rahoittaa aloittavan toimintansa lyhytaikaisella ja pitkäaikaisella velalla ja omalla pääomalla. Muuta taulukon vihreissä ruuduissa olevat esimerkkiluvut oman yrityksesi arvioiduiksi luvuiksi. Pohdi antamiasi lukuja mahdollisimman huolellisesti."]
[]
["Syötä ensin laskelmissa käytettävät lukuarvot pitkäaikaisen omaisuuden käyttöajoille, verolle ja muille tekijöille:"]
["Pitkäaikaisen omaisuuden keskimääräinen käyttöaika:",null,null,null,null,"Käyttöaika vuosina","Poisto-osuus"]
["Miten monta vuotta arvioit ratsastuskoululle hankittavien hevosten keskimäärin osallistuvan opetustunneille?",null,null,null,null,10,{"$f":"1/F10","v":0.1}]
["Miten monta vuotta arvioit hankkimiesi rakennusten ja rakennelmien (esim. maneesi, talli) toimivan opetuskäytössä?",null,null,null,null,15,{"$f":"1/F11","v":6.6666666666666666E-2}]
["Miten monta vuotta arvioit  hankkimiesi koneiden ja kaluston (esim. traktori, hara, aura) toimivan opetuskäytössä?",null,null,null,null,4,{"$f":"1/F12","v":0.25}]
["Miten pitkäaikaiseen käyttöön hankkimasi aineeton käyttöomaisuus (esim. tietokoneohjelmat) on tarkoitettu?",null,null,null,null,5,{"$f":"1/F13","v":0.2}]
["Miten pitkäaikaiseen käyttöön hankkimasi muu käyttöomaisuus (esim. työkalut, muu irtaimisto) on tarkoitettu?",null,null,null,null,2,{"$f":"1/F14","v":0.5}]
[]
["Muut tiedot:",null,null,null,null,"Muut tiedot","%-osuus"]
["Kuinka monta prosenttia yrityksesi maksaa veroja verotettavasta tuloksesta? (esim. osakeyhtiöillä verokanta on 20 % 2021)",null,null,null,null,20,{"$f":"+F17/100","v":0.2}]
["Miten suureksi arvioit yrityksellesi mahdollisesti ottamasi lyhytaikaisen (alle vuoden mittaisen) velan vuotuisen korkoprosentin?",null,null,null,null,3,{"$f":"+F18/100","v":0.03}]
["Miten suureksi arvioit yrityksellesi mahdollisesti ottamasi pitkäaikaisen (yli vuoden mittaisen) velan vuotuisen korkoprosentin?",null,null,null,null,2,{"$f":"+F19/100","v":0.02}]
["Miten monta vuotta pitkäaikaista velkaa maksetaan takaisin? (mallissa oletetaan yhtä suuret vuosittaiset lyhennykset)",null,null,null,null,5,5]
["Miten paljon aiot nostaa yrityksestä voitto-osuutta (esim. osinkoja) prosentteina yrityksen tuottamista kertyneistä voitoista?",null,null,null,null,5,{"$f":"+F21/100","v":0.05}]
["Miten paljon vähintään aiot pitää rahaa kassassa ja pankkitilillä toiminnan pyörittämistä varten prosentteina liikevaihdosta?",null,null,null,null,5,{"$f":"+F22/100","v":0.05}]
["Miten monta prosenttia arvioit yrityksesi liikevaihdon kasvavan vuosittain viiden vuoden aikana?",null,null,null,null,5,{"$f":"+F23/100","v":0.05}]
["Miten monta prosenttia arvioit yrityksesi kiinteiden kustannusten kasvavan vuosittain viiden vuoden aikana?",null,null,null,null,3,{"$f":"+F24/100","v":0.03}]
[]
["Laadi sen jälkeen arvio ratsastuskoulun ensimmäisen vuoden liikevaihdosta. "]
[]
["Miten korkeaksi arvioit ratsastuskoulusi ratsastustunnin keskimääräisen hinnan?",null,null,null,null,27,"euroa",{"$f":"+IF(F28<0,\"Luvun pitää olla positiivinen\",\"\")","v":""}]
["Kuinka monta hevosta sinulla on ratsastuskoulutoiminnassa?",null,null,null,null,10,"hevosta",{"$f":"+IF(F29<0,\"Luvun pitää olla positiivinen\",\"\")","v":""}]
["Kuinka monta tuntia keskimäärin hevonen osallistuu ratsastustunnille viikottain? (vuodessa on 52 viikkoa)",null,null,null,null,15,"tuntia viikossa",""]
["Montako hevosta on keskimäärin yhdessä opetusryhmässä?",null,null,null,null,6,"hevosta",""]
["Miten täysiksi arvioit opetusryhmät keskimäärin prosentteina 0 - 100 % (täydet ryhmät)?",null,null,null,null,85,"%",{"$f":"+IF(F32<0,\"Luvun pitää olla positiivinen\",IF(F32>100,\"Luvun pitää olla alle 100\",\"\"))","v":""}]
["Miten monta hevosta keskimäärin on koulun hevosten lisäksi tallissa täysihoidossa?",null,null,null,null,5,"hevosta",{"$f":"+IF(F33<0,\"Luvun pitää olla positiivinen\",IF(F33>100,\"Luvun pitää olla alle 100\",\"\"))","v":""}]
["Miten paljon arvioit täysihoidon hinnaksi hevosta kohti kuukaudessa?",null,null,null,null,600,"euroa / kk"]
["Esittämiesi lukujen perusteella ensimmäisen vuoden liikevaihto on siten seuraava:",null,null,null,null,{"$f":"+(F32/100)*(F28*F29*F30*52)+F33*F34*12","v":215010},"euroa"]
[]
["Ratsastuskoulun ensimmäisen vuoden ennakoitu liikevaihto on:",null,null,null,null,{"$f":"+F35","v":215010},"euroa"]
[]
["Kuinka monta ratsastustuntia tarkoituksesi on itse pitää (ilman palkanmaksua) ratsastuskoulun tunneista keskimäärin viikossa?",null,null,null,null,0,"tuntia viikossa"]
[]
["Laadi sitten arvio yrityksen kulujen määrästä."]
[]
["Muuttuvat kulut:"]
["Millaisiksi arvioit ensimmäisen vuoden muuttuvat kulut, jotka riippuvat suoraan hevosten määrästä?",null,null,null,null,"Vuodessa:","Liikevaih-dosta, %"]
["Miten paljon kulut karkearehusta ovat hevosta kohti kuukaudessa (euroa / hevonen / kuukausi)?",null,null,null,100,{"$f":"+E45*(12*$F$29+12*$F$33)","v":18000},{"$f":"100*F45/$F$37","v":8.3717036416910844},{"$f":"+IF(E45<0,\"Kulujen määrä ei saa olla negatiivinen\",\"\")","v":""}]
["Miten paljon kulut väkirehusta ovat hevosta kohti kuukaudessa (euroa / hevonen / kuukausi)?",null,null,null,20,{"$f":"+E46*(12*$F$29+12*$F$33)","v":3600},1.6743407283382168,{"$f":"+IF(E46<0,\"Kulujen määrä ei saa olla negatiivinen\",\"\")","v":""}]
["Miten paljon kulut kivennäisistä ovat hevosta kohti kuukaudessa (euroa / hevonen / kuukausi)?",null,null,null,20,{"$f":"+E47*(12*$F$29+12*$F$33)","v":3600},1.6743407283382168,""]
["Miten paljon muut ruokintakulut ovat hevosta kohti kuukaudessa (euroa / hevonen / kuukausi)?",null,null,null,20,3600,1.6743407283382168,""]
["Miten paljon kuivikekulut ovat hevosta kohti kuukaudessa (euroa / hevonen / kuukausi)?",null,null,null,50,9000,4.1858518208455422,""]
["Miten paljon kengityskulut ovat hevosta kohti kuukaudessa (euroa / hevonen / kuukausi)?",null,null,null,50,{"$f":"+E50*12*$F$29","v":6000},2.7905678805636946,""]
["Miten paljon madotuskulut ovat hevosta kohti vuodessa (euroa / hevonen / vuosi)?",null,null,null,50,{"$f":"+E51*$F$29","v":500},0.2325473233803079,""]
["Miten paljon rokotuskulut ovat hevosta kohti vuodessa (euroa / hevonen / vuosi)?",null,null,null,100,{"$f":"+E52*$F$29","v":1000},0.46509464676061579,""]
["Miten paljon raspauskulut ovat hevosta kohti vuodessa (euroa / hevonen / vuosi)?",null,null,null,100,{"$f":"+E53*$F$29","v":1000},0.46509464676061579,""]
["Miten paljon eläinlääkärikulut ovat hevosta kohti vuodessa (euroa / hevonen / vuosi)?",null,null,null,200,{"$f":"+E54*$F$29","v":2000},0.93018929352123159,""]
["Miten paljon varustekulut (esim. satulat, suitset) ovat hevosta kohti vuodessa (euroa / hevonen / vuosi)?",null,null,null,500,{"$f":"+E55*$F$29","v":5000},2.3254732338030788,""]
["Miten paljon ratsastuksen opettajien palkat lisineen ovat opetustuntia kohti (tuntipalkka, euroa / tunti)?",null,null,null,35,{"$f":"+E56*((F29*F30*52)/F31-F39*52)","v":45500},21.161806427608017,""]
["Miten paljon täysihoidon muuttuvat palkat lisineen (esim. hoitaja) ovat täysihoidossa olevaa hevosta kohti kuukaudessa? (euroa / hevonen / kuukausi)",null,null,null,200,{"$f":"+E57*$F$33*12","v":12000},5.5811357611273893,""]
["Miten paljon muut muuttuvat kulut (esim. tarvikkeet, vakuutukset) ovat koulun hevosta kohti vuodessa  (euroa / hevonen / vuosi)?",null,null,null,200,{"$f":"+E58*$F$29","v":2000},0.93018929352123159,""]
["Ensimmäisen vuoden ennakoitu myyntikate (liikevaihto - muuttuvat kulut) on:",null,null,null,null,{"$f":"+F37-SUM(F45:F58)","v":102210},47.53732384540254]
[]
["Kiinteät kulut:",null,null,{"$f":"+IF(B61<0,\" Huom! Luvun pitää olla positiivinen tai nolla!\",\"\")","v":""}]
["Millaisiksi arvioit ensimmäisen vuoden kiinteät kulut?"]
["Kuinka paljon arvioit vuokrakuluiksi kuukaudessa käyttämistäsi tiloista? (euroa / kuukausi) (jos vuokratiloja)",null,null,null,0,{"$f":"12*E63","v":0},{"$f":"100*F63/$F$37","v":0},{"$f":"+IF(E63<0,\"Kulujen määrä ei saa olla negatiivinen\",\"\")","v":""}]
["Kuinka paljon arvioit sähkön kulutuksen kuluiksi kuukaudessa? (euroa / kuukausi) ",null,null,null,200,{"$f":"12*E64","v":2400},1.1162271522254779,""]
["Kuinka paljon arvioit veden kulutuksen kuluiksi kuukaudessa? (euroa / kuukausi) ",null,null,null,100,1200,0.55811357611273893,""]
["Kuinka paljon arvioit pohjien huollon kuluiksi kuukaudessa (maneesi ja ratsastuskenttä)? (euroa / kuukausi) ",null,null,null,250,3000,1.3952839402818473,""]
["Kuinka paljon arvioit lantalan tyhjennyksen kuluiksi kuukaudessa? (euroa / kuukausi) ",null,null,null,100,1200,0.55811357611273893,""]
["Kuinka suuriksi arvioit kiinteät palkkakustannukset lisineen (esim. tallityöntekijät, kirjanpitäjä) kuukaudessa?",null,null,null,2000,24000,11.162271522254779,""]
["Kuinka suuriksi arvioit muut edellä mainitsemattomat kiinteät kulut kuukaudessa? (euroa / kuukausi)",null,null,null,100,1200,0.55811357611273893,""]
[]
["Ensimmäisen vuoden ennakoitu käyttökate (liikevaihto - muuttuvat kulut - kiinteät kulut) on:",null,null,null,null,{"$f":"+F59-SUM(F63:F69)","v":69210},32.189200502302221]
[]
["Esittämiesi lukujen perusteella arvioit ensimmäisen vuoden kuluiksi yhteensä:",null,null,null,null,{"$f":"+SUM(F45:F58)+SUM(F63:F69)","v":145800},67.810799497697786]
[{"$f":"+IF(F74>0,\"Esittämiesi lukujen perusteella liikevaihdon ja muuttuvien kulujen erotus (myyntikate) on:\",\"Muuta antamiasi tietoja, sillä liikevaihdon ja muuttuvien kulujen erotus on negatiivinen:\")","v":"Esittämiesi lukujen perusteella liikevaihdon ja muuttuvien kulujen erotus (myyntikate) on:"},null,null,null,null,{"$f":"+F59","v":102210},47.53732384540254]
[{"$f":"+IF(F75>0,\"Esittämiesi lukujen perusteella liikevaihdon ja  kulujen erotus (käyttökate) on:\",\"Muuta antamiasi tietoja, sillä liikevaihdon ja kulujen erotus on negatiivinen:\")","v":"Esittämiesi lukujen perusteella liikevaihdon ja  kulujen erotus (käyttökate) on:"},null,null,null,null,{"$f":"+F71","v":69210},32.189200502302221]
[]
["Investoinnit (pitkäaikaiset sijoitukset) ratsastuskouluun:"]
["Miten paljon aiot investoida euroissa ratsastuskouluun ensimmäisenä vuonna, kun pitkäaikainen omaisuus hankitaan?"]
["Miten paljon aiot sijoittaa euroja hevosten hankkimiseen ratsastuskoulun toimintaa varten?",null,null,null,null,30000,{"$f":"100*F79/$F$37","v":13.952839402818473},{"$f":"+IF(F79<0,\"Investoitu määrä ei saa olla negatiivinen\",\"\")","v":""}]
["Miten paljon aiot sijoittaa euroja maa- ja vesialueisiin? (esim. tontin ostamiseen)",null,null,null,null,40000,18.60378587042463,{"$f":"+IF(F80<0,\"Investoitu määrä ei saa olla negatiivinen\",\"\")","v":""}]
["Miten paljon aiot sijoittaa euroja rakennuksiin ja rakennelmiin? (esim. talli ja maneesi)",null,null,null,null,200000,93.018929352123152,""]
["Miten paljon aiot sijoittaa euroja koneisiin ja kalustoon (esim. traktori, hara, aura)?",null,null,null,null,50000,23.254732338030788,""]
["Miten paljon aiot sijoittaa euroja aineettomaan käyttöomaisuuteen (esim. tietokoneohjelmat)?",null,null,null,null,1000,0.46509464676061579,""]
["Miten paljon aiot sijoittaa euroja muuhun käyttöomaisuuteen (esim. työkalut, muu irtaimisto)?",null,null,null,null,1000,0.46509464676061579,""]
["Esittämiesi lukujen perusteella sijoitat euroja yrityksesi omaisuuteen yhteensä:",null,null,null,null,{"$f":"+SUM(F79:F84)","v":322000},149.76047625691828]
[]
["Ratsastuskoulun toiminnan rahoitus:"]
["Millä tavalla aiot rahoittaa ratsastuskoulun ensimmäisen toimintavuoden investoinnit ja toiminnan?"]
["Miten paljon aiot ottaa lyhytaikaista velkaa toimintaa varten? (euroja)",null,null,{"$f":"+IF(C89<0,\" Huom! Luvun pitää olla positiivinen tai nolla!\",\"\")","v":""},null,20000,"euroa",{"$f":"+IF(F89<0,\"Rahoituksen määrä ei saa olla negatiivinen\",\"\")","v":""}]
["Miten paljon aiot ottaa pitkäaikaista velkaa investointien rahoittamista varten? (euroja)",null,null,{"$f":"+IF(C90<0,\" Huom! Luvun pitää olla positiivinen tai nolla!\",\"\")","v":""},null,270000,"euroa",{"$f":"+IF(F90<0,\"Rahoituksen määrä ei saa olla negatiivinen\",\"\")","v":""}]
["Miten paljon aiot sijoittaa toimintaan omaa pääomaa? (euroja)",null,null,null,null,10000,"euroa",""]
["Esittämiesi lukujen perusteella otat ensimmäisenä vuonna velkaa ja sijoitat omaa pääomaa yritykseesi yhteensä:",null,null,null,null,{"$f":"+SUM(F89:F91)","v":300000},"euroa"]
[]
["Sijoittamasi oman pääoman osuus rahoituksesta ilman toiminnan tuottamaa tulorahoitusta on:",null,null,null,null,{"$f":"100*F91/F92","v":3.3333333333333335},"%"]
["Sijoitetun oman pääoman ja pitkäaikaisen velan osuus investointien rahoituksesta on:",null,null,null,null,{"$f":"100*(F90+F91)/F85","v":86.956521739130437},"%"]
[]
[]
["MALLIN TUOTTAMAT TILINPÄÄTÖSLASKELMAT VIIDELLE VUODELLE"]
[]
[{"$f":"+T!B3","v":"ENNAKOITU TULOSLASKELMA"}]
[null,{"$f":"+T!C4","v":"Ennakoidut viisi vuotta:"}]
[null,{"$f":"+T!C5","v":1},{"$f":"+T!D5","v":2},{"$f":"+T!E5","v":3},{"$f":"+T!F5","v":4},{"$f":"+T!G5","v":5}]
[{"$f":"+T!B6","v":"Liikevaihto"},{"$f":"+T!C6","v":215010},{"$f":"+T!D6","v":225760.5},{"$f":"+T!E6","v":237048.52499999999},{"$f":"+T!F6","v":248900.95125000001},{"$f":"+T!G6","v":261345.99881250001}]
[{"$f":"+T!B7","v":" - Muuttuvat kulut"}]
[{"$f":"+T!B8","v":"Karkearehu"},{"$f":"+T!C8","v":18000},{"$f":"+T!D8","v":18900},{"$f":"+T!E8","v":19845},{"$f":"+T!F8","v":20837.250000000004},{"$f":"+T!G8","v":21879.112500000003}]
[{"$f":"+T!B9","v":"Väkirehu"},{"$f":"+T!C9","v":3599.9999999999995},{"$f":"+T!D9","v":3779.9999999999995},{"$f":"+T!E9","v":3968.9999999999995},{"$f":"+T!F9","v":4167.45},{"$f":"+T!G9","v":4375.8224999999993}]
[{"$f":"+T!B10","v":"Kivennäiset"},{"$f":"+T!C10","v":3599.9999999999995},{"$f":"+T!D10","v":3779.9999999999995},{"$f":"+T!E10","v":3968.9999999999995},{"$f":"+T!F10","v":4167.45},{"$f":"+T!G10","v":4375.8224999999993}]
[{"$f":"+T!B11","v":"Muut ruokintakustannukset"},{"$f":"+T!C11","v":3599.9999999999995},{"$f":"+T!D11","v":3779.9999999999995},{"$f":"+T!E11","v":3968.9999999999995},{"$f":"+T!F11","v":4167.45},{"$f":"+T!G11","v":4375.8224999999993}]
[{"$f":"+T!B12","v":"Kuivikekustannukset"},{"$f":"+T!C12","v":9000},{"$f":"+T!D12","v":9450},{"$f":"+T!E12","v":9922.5},{"$f":"+T!F12","v":10418.625000000002},{"$f":"+T!G12","v":10939.556250000001}]
[{"$f":"+T!B13","v":"Kengitykset"},{"$f":"+T!C13","v":6000},{"$f":"+T!D13","v":6300},{"$f":"+T!E13","v":6614.9999999999991},{"$f":"+T!F13","v":6945.75},{"$f":"+T!G13","v":7293.0374999999995}]
[{"$f":"+T!B14","v":"Madotukset"},{"$f":"+T!C14","v":500.00000000000006},{"$f":"+T!D14","v":525},{"$f":"+T!E14","v":551.25},{"$f":"+T!F14","v":578.81250000000011},{"$f":"+T!G14","v":607.75312500000007}]
[{"$f":"+T!B15","v":"Rokotukset"},{"$f":"+T!C15","v":1000.0000000000001},{"$f":"+T!D15","v":1050},{"$f":"+T!E15","v":1102.5},{"$f":"+T!F15","v":1157.6250000000002},{"$f":"+T!G15","v":1215.5062500000001}]
[{"$f":"+T!B16","v":"Raspaukset"},{"$f":"+T!C16","v":1000.0000000000001},{"$f":"+T!D16","v":1050},{"$f":"+T!E16","v":1102.5},{"$f":"+T!F16","v":1157.6250000000002},{"$f":"+T!G16","v":1215.5062500000001}]
[{"$f":"+T!B17","v":"Muut eläinlääkärikulut"},{"$f":"+T!C17","v":2000.0000000000002},{"$f":"+T!D17","v":2100},{"$f":"+T!E17","v":2205},{"$f":"+T!F17","v":2315.2500000000005},{"$f":"+T!G17","v":2431.0125000000003}]
[{"$f":"+T!B18","v":"Varustekustannukset"},{"$f":"+T!C18","v":5000},{"$f":"+T!D18","v":5250},{"$f":"+T!E18","v":5512.4999999999991},{"$f":"+T!F18","v":5788.125},{"$f":"+T!G18","v":6077.53125}]
[{"$f":"+T!B19","v":"Ratsastuksen opettajien palkat lisineen"},{"$f":"+T!C19","v":45500},{"$f":"+T!D19","v":47775},{"$f":"+T!E19","v":50163.75},{"$f":"+T!F19","v":52671.9375},{"$f":"+T!G19","v":55305.534375000003}]
[{"$f":"+T!B20","v":"Täyshoitohevosten hoitajien palkat lisineen"},{"$f":"+T!C20","v":12000},{"$f":"+T!D20","v":12600},{"$f":"+T!E20","v":13229.999999999998},{"$f":"+T!F20","v":13891.5},{"$f":"+T!G20","v":14586.074999999999}]
[{"$f":"+T!B21","v":"Muut muuttuvat kulut"},{"$f":"+T!C21","v":2000.0000000000002},{"$f":"+T!D21","v":2100},{"$f":"+T!E21","v":2205},{"$f":"+T!F21","v":2315.2500000000005},{"$f":"+T!G21","v":2431.0125000000003}]
[{"$f":"+T!B22","v":" = Myyntikate"},{"$f":"+T!C22","v":102210},{"$f":"+T!D22","v":107320.5},{"$f":"+T!E22","v":112686.52499999999},{"$f":"+T!F22","v":118320.85125000001},{"$f":"+T!G22","v":124236.8938125}]
[{"$f":"+T!B23","v":" - Kiinteät kulut"}]
[{"$f":"+T!B24","v":"Vuokrakulut"},{"$f":"+T!C24","v":0},{"$f":"+T!D24","v":0},{"$f":"+T!E24","v":0},{"$f":"+T!F24","v":0},{"$f":"+T!G24","v":0}]
[{"$f":"+T!B25","v":"Sähkökulut"},{"$f":"+T!C25","v":2400},{"$f":"+T!D25","v":2472},{"$f":"+T!E25","v":2546.16},{"$f":"+T!F25","v":2622.5448000000001},{"$f":"+T!G25","v":2701.2211439999996}]
[{"$f":"+T!B26","v":"Vesikulut"},{"$f":"+T!C26","v":1200},{"$f":"+T!D26","v":1236},{"$f":"+T!E26","v":1273.08},{"$f":"+T!F26","v":1311.2724000000001},{"$f":"+T!G26","v":1350.6105719999998}]
[{"$f":"+T!B27","v":"Pohjien huolto"},{"$f":"+T!C27","v":3000},{"$f":"+T!D27","v":3090},{"$f":"+T!E27","v":3182.7},{"$f":"+T!F27","v":3278.181},{"$f":"+T!G27","v":3376.5264299999999}]
[{"$f":"+T!B28","v":"Lantalan tyhjennys"},{"$f":"+T!C28","v":1200},{"$f":"+T!D28","v":1236},{"$f":"+T!E28","v":1273.08},{"$f":"+T!F28","v":1311.2724000000001},{"$f":"+T!G28","v":1350.6105719999998}]
[{"$f":"+T!B29","v":"Kiinteät palkkakustannukset lisineen"},{"$f":"+T!C29","v":24000},{"$f":"+T!D29","v":24720},{"$f":"+T!E29","v":25461.599999999999},{"$f":"+T!F29","v":26225.448},{"$f":"+T!G29","v":27012.211439999999}]
[{"$f":"+T!B31","v":" = Käyttökate"},{"$f":"+T!C31","v":69210},{"$f":"+T!D31","v":73330.5},{"$f":"+T!E31","v":77676.824999999997},{"$f":"+T!F31","v":82260.860249999998},{"$f":"+T!G31","v":87095.103082499991}]
[{"$f":"+T!B32","v":" - Poistot"}]
[{"$f":"+T!B33","v":"Hevosten hankinta"},{"$f":"+T!C33","v":3000},{"$f":"+T!D33","v":3000},{"$f":"+T!E33","v":3000},{"$f":"+T!F33","v":3000},{"$f":"+T!G33","v":3000}]
[{"$f":"+T!B34","v":"Maa- ja vesialueet"},{"$f":"+T!C34","v":0},{"$f":"+T!D34","v":0},{"$f":"+T!E34","v":0},{"$f":"+T!F34","v":0},{"$f":"+T!G34","v":0}]
[{"$f":"+T!B35","v":"Rakennukset ja rakennelmat"},{"$f":"+T!C35","v":13333.333333333334},{"$f":"+T!D35","v":13333.333333333334},{"$f":"+T!E35","v":13333.333333333334},{"$f":"+T!F35","v":13333.333333333334},{"$f":"+T!G35","v":13333.333333333334}]
[{"$f":"+T!B36","v":"Koneet ja kalusto"},{"$f":"+T!C36","v":12500},{"$f":"+T!D36","v":12500},{"$f":"+T!E36","v":12500},{"$f":"+T!F36","v":12500},{"$f":"+T!G36","v":0}]
[{"$f":"+T!B37","v":"Aineeton käyttöomaisuus"},{"$f":"+T!C37","v":200},{"$f":"+T!D37","v":200},{"$f":"+T!E37","v":200},{"$f":"+T!F37","v":200},{"$f":"+T!G37","v":200}]
[{"$f":"+T!B38","v":"Muu käyttöomaisuus"},{"$f":"+T!C38","v":500},{"$f":"+T!D38","v":500},{"$f":"+T!E38","v":0},{"$f":"+T!F38","v":0},{"$f":"+T!G38","v":0}]
[{"$f":"+T!B39","v":" = Liiketulos"},{"$f":"+T!C39","v":39676.666666666664},{"$f":"+T!D39","v":43797.166666666664},{"$f":"+T!E39","v":48643.491666666661},{"$f":"+T!F39","v":53227.526916666662},{"$f":"+T!G39","v":70561.769749166648}]
[{"$f":"+T!B40","v":" - Korkokulut"},{"$f":"+T!C40","v":6000},{"$f":"+T!D40","v":6000},{"$f":"+T!E40","v":4920},{"$f":"+T!F40","v":3840},{"$f":"+T!G40","v":2760}]
[{"$f":"+T!B41","v":" - Verot"},{"$f":"+T!C41","v":6735.333333333333},{"$f":"+T!D41","v":7559.4333333333334},{"$f":"+T!E41","v":8744.6983333333319},{"$f":"+T!F41","v":9877.5053833333332},{"$f":"+T!G41","v":13560.35394983333}]
[{"$f":"+T!B42","v":"Tilikauden tulos"},{"$f":"+T!C42","v":26941.333333333332},{"$f":"+T!D42","v":30237.73333333333},{"$f":"+T!E42","v":34978.793333333328},{"$f":"+T!F42","v":39510.021533333333},{"$f":"+T!G42","v":54241.415799333321}]
[]
[{"$f":"+T!B44","v":"ENNAKOITU TASE"}]
[null,{"$f":"+T!C45","v":"Ennakoidut viisi vuotta:"}]
[null,{"$f":"+T!C46","v":1},{"$f":"+T!D46","v":2},{"$f":"+T!E46","v":3},{"$f":"+T!F46","v":4},{"$f":"+T!G46","v":5}]
[{"$f":"+T!B47","v":"Taseen omaisuus"}]
[{"$f":"+T!B48","v":"Lyhytaikainen:"}]
[{"$f":"+T!B49","v":"Rahoitusomaisuus"},{"$f":"+T!C49","v":34474.666666666686},{"$f":"+T!D49","v":38898.666666666693},{"$f":"+T!E49","v":46119.193333333358},{"$f":"+T!F49","v":56261.588533333364},{"$f":"+T!G49","v":66879.924906000029}]
[{"$f":"+T!B50","v":"Pitkäaikainen:"}]
[{"$f":"+T!B51","v":"Hevosten hankinta"},{"$f":"+T!C51","v":27000},{"$f":"+T!D51","v":24000},{"$f":"+T!E51","v":21000},{"$f":"+T!F51","v":18000},{"$f":"+T!G51","v":15000}]
[{"$f":"+T!B52","v":"Maa- ja vesialueet"},{"$f":"+T!C52","v":40000},{"$f":"+T!D52","v":40000},{"$f":"+T!E52","v":40000},{"$f":"+T!F52","v":40000},{"$f":"+T!G52","v":40000}]
[{"$f":"+T!B53","v":"Rakennukset ja rakennelmat"},{"$f":"+T!C53","v":186666.66666666666},{"$f":"+T!D53","v":173333.33333333331},{"$f":"+T!E53","v":159999.99999999997},{"$f":"+T!F53","v":146666.66666666663},{"$f":"+T!G53","v":133333.33333333328}]
[{"$f":"+T!B54","v":"Koneet ja kalusto"},{"$f":"+T!C54","v":37500},{"$f":"+T!D54","v":25000},{"$f":"+T!E54","v":12500},{"$f":"+T!F54","v":0},{"$f":"+T!G54","v":0}]
[{"$f":"+T!B55","v":"Aineeton käyttöomaisuus"},{"$f":"+T!C55","v":800},{"$f":"+T!D55","v":600},{"$f":"+T!E55","v":400},{"$f":"+T!F55","v":200},{"$f":"+T!G55","v":0}]
[{"$f":"+T!B56","v":"Muu käyttöomaisuus"},{"$f":"+T!C56","v":500},{"$f":"+T!D56","v":0},{"$f":"+T!E56","v":0},{"$f":"+T!F56","v":0},{"$f":"+T!G56","v":0}]
[{"$f":"+T!B57","v":"Yhteensä"},{"$f":"+T!C57","v":326941.33333333331},{"$f":"+T!D57","v":301832},{"$f":"+T!E57","v":280019.19333333336},{"$f":"+T!F57","v":261128.25519999999},{"$f":"+T!G57","v":255213.25823933331}]
[]
[{"$f":"+T!B59","v":"Taseen pääoma"}]
[{"$f":"+T!B60","v":"Lyhytaikainen:"}]
[{"$f":"+T!B61","v":"Lyhytaikaiset velat (maks. voitto-osuus)"},{"$f":"+T!C61","v":1347.0666666666666},{"$f":"+T!D61","v":2791.6000000000004},{"$f":"+T!E61","v":4400.9596666666666},{"$f":"+T!F61","v":6156.4127600000002},{"$f":"+T!G61","v":8560.6629119666668}]
[{"$f":"+T!B62","v":"Muu lyhytaikainen vieras pääoma"},{"$f":"+T!C62","v":20000},{"$f":"+T!D62","v":20000},{"$f":"+T!E62","v":20000},{"$f":"+T!F62","v":20000},{"$f":"+T!G62","v":20000}]
[{"$f":"+T!B63","v":"Pitkäaikainen:"}]
[{"$f":"+T!B64","v":"Pitkäaikainen vieras pääoma"},{"$f":"+T!C64","v":270000},{"$f":"+T!D64","v":216000},{"$f":"+T!E64","v":162000},{"$f":"+T!F64","v":108000},{"$f":"+T!G64","v":54000}]
[{"$f":"+T!B65","v":"Sijoitettu oma pääoma"},{"$f":"+T!C65","v":10000},{"$f":"+T!D65","v":10000},{"$f":"+T!E65","v":10000},{"$f":"+T!F65","v":10000},{"$f":"+T!G65","v":10000}]
[{"$f":"+T!B66","v":"Kertyneet voittovarat ja muu oma pääoma"},{"$f":"+T!C66","v":25594.266666666666},{"$f":"+T!D66","v":53040.4},{"$f":"+T!E66","v":83618.233666666667},{"$f":"+T!F66","v":116971.84243999999},{"$f":"+T!G66","v":162652.59532736664}]
[{"$f":"+T!B67","v":"Yhteensä"},{"$f":"+T!C67","v":326941.33333333331},{"$f":"+T!D67","v":301832},{"$f":"+T!E67","v":280019.19333333336},{"$f":"+T!F67","v":261128.25520000001},{"$f":"+T!G67","v":255213.25823933331}]
[]
[{"$f":"+T!B69","v":"ENNAKOIDUT TUNNUSLUVUT"}]
[null,{"$f":"+T!C70","v":"Ennakoidut viisi vuotta:"}]
[null,{"$f":"+T!C71","v":1},{"$f":"+T!D71","v":2},{"$f":"+T!E71","v":3},{"$f":"+T!F71","v":4},{"$f":"+T!G71","v":5}]
[{"$f":"+T!B72","v":"Koko"}]
[{"$f":"+T!B73","v":"1. Liikevaihto (Euro)"},{"$f":"+T!C73","v":215010},{"$f":"+T!D73","v":225760.5},{"$f":"+T!E73","v":237048.52499999999},{"$f":"+T!F73","v":248900.95125000001},{"$f":"+T!G73","v":261345.99881250001}]
[{"$f":"+T!B74","v":"2. Taseen loppusumma (Euro)"},{"$f":"+T!C74","v":326941.33333333331},{"$f":"+T!D74","v":301832},{"$f":"+T!E74","v":280019.19333333336},{"$f":"+T!F74","v":261128.25519999999},{"$f":"+T!G74","v":255213.25823933331}]
[{"$f":"+T!B75","v":"3. Tilikauden tulos (Euro)"},{"$f":"+T!C75","v":26941.333333333332},{"$f":"+T!D75","v":30237.73333333333},{"$f":"+T!E75","v":34978.793333333328},{"$f":"+T!F75","v":39510.021533333333},{"$f":"+T!G75","v":54241.415799333321}]
[{"$f":"+T!B76","v":"4. Voitto-osuus omistajalle (Euro)"},{"$f":"+T!C76","v":1347.0666666666666},{"$f":"+T!D76","v":2791.6000000000004},{"$f":"+T!E76","v":4400.9596666666666},{"$f":"+T!F76","v":6156.4127600000002},{"$f":"+T!G76","v":8560.6629119666668}]
[]
[{"$f":"+T!B78","v":"Kasvu"}]
[{"$f":"+T!B79","v":"1. Liikevaihdon kasvu-%"},null,{"$f":"+T!D79","v":5},{"$f":"+T!E79","v":5},{"$f":"+T!F79","v":5},{"$f":"+T!G79","v":5}]
[{"$f":"+T!B80","v":"2. Taseen loppusumman kasvu-%"},null,{"$f":"+T!D80","v":-7.6800730814090912},{"$f":"+T!E80","v":-7.2268038732363209},{"$f":"+T!F80","v":-6.7463011761646214},{"$f":"+T!G80","v":-2.2651692579710812}]
[{"$f":"+T!B81","v":"3. Tilikauden tuloksen kasvu-%"},null,{"$f":"+T!D81","v":12.23547461150153},{"$f":"+T!E81","v":15.679283720561045},{"$f":"+T!F81","v":12.954215306455225},{"$f":"+T!G81","v":37.285209408381576}]
[]
[{"$f":"+T!B83","v":"Kannattavuus"}]
[{"$f":"+T!B84","v":"1. Käyttökate / Liikevaihto (%)"},{"$f":"+T!C84","v":32.189200502302221},{"$f":"+T!D84","v":32.481545708837466},{"$f":"+T!E84","v":32.76832243524823},{"$f":"+T!F84","v":33.049636747822589},{"$f":"+T!G84","v":33.3255926925384}]
[{"$f":"+T!B85","v":"2. Liiketulos / Liikevaihto (%)"},{"$f":"+T!C85","v":18.45340526797203},{"$f":"+T!D85","v":19.399835961856329},{"$f":"+T!E85","v":20.520478525089604},{"$f":"+T!F85","v":21.385023500052476},{"$f":"+T!G85","v":26.999368679751804}]
[{"$f":"+T!B86","v":"3. Tilikauden tulos / Liikevaihto (%)"},{"$f":"+T!C86","v":12.530269909926668},{"$f":"+T!D86","v":13.393721812865108},{"$f":"+T!E86","v":14.755963292044667},{"$f":"+T!F86","v":15.873792902321554},{"$f":"+T!G86","v":20.754637930480914}]
[{"$f":"+T!B87","v":"4. Sijoitetun pääoman tuotto-%"},null,{"$f":"+T!D87","v":13.396032315685586},{"$f":"+T!E87","v":16.116081683408868},{"$f":"+T!F87","v":19.00852805232708},{"$f":"+T!G87","v":27.021882291184035}]
[{"$f":"+T!B88","v":"5. Oman pääoman tuotto-%"},null,{"$f":"+T!D88","v":84.951134452364983},{"$f":"+T!E88","v":55.486312481096768},{"$f":"+T!F88","v":42.203340082244161},{"$f":"+T!G88","v":42.719247635525868}]
[]
[{"$f":"+T!B90","v":"Maksuvalmius"}]
[{"$f":"+T!B91","v":"1. Rahoitustulos / Liikevaihto"},{"$f":"+T!C91","v":26.266065144256856},{"$f":"+T!D91","v":26.475431559846239},{"$f":"+T!E91","v":27.003807202203287},{"$f":"+T!F91","v":27.538406150091667},{"$f":"+T!G91","v":27.080861943267504}]
[{"$f":"+T!B92","v":"2. Quick ratio"},{"$f":"+T!C92","v":1.6149603692622885},{"$f":"+T!D92","v":1.7067106594827346},{"$f":"+T!E92","v":1.8900565372572311},{"$f":"+T!F92","v":2.1509673000485776},{"$f":"+T!G92","v":2.341679712132239}]
[]
[{"$f":"+T!B94","v":"Vakavaraisuus"}]
[{"$f":"+T!B95","v":"1. Omavaraisuusaste"},{"$f":"+T!C95","v":10.887050072184204},{"$f":"+T!D95","v":20.885923295078058},{"$f":"+T!E95","v":33.432791714110834},{"$f":"+T!F95","v":48.624321539908173},{"$f":"+T!G95","v":67.650323701230619}]
[{"$f":"+T!B96","v":"2. Rahoitustulos / Velat (%)"},{"$f":"+T!C96","v":19.383983272184427},{"$f":"+T!D96","v":25.030640385451861},{"$f":"+T!E96","v":34.341092868372016},{"$f":"+T!F96","v":51.09211960615535},{"$f":"+T!G96","v":85.724540763599265}]
[]
[{"$f":"+T!B98","v":"Rahoitusriski: Taipumus kuulua konkurssiyritysten (1) tai toimivien yritysten (0) joukkoon"}]
[{"$f":"+T!B99","v":"1. Kolmen muuttujan P-luku "},{"$f":"+T!C99","v":0.55562024372303342},{"$f":"+T!D99","v":0.48694397851049387},{"$f":"+T!E99","v":0.40048716786581695},{"$f":"+T!F99","v":0.3038293826107476},{"$f":"+T!G99","v":0.20657542726185887}]
[]
[]
[{"$f":"+T!B102","v":"TULKINTARAPORTTI"}]
[]
[null,{"$f":"+T!C104","v":"Ennakoidut viisi vuotta:"}]
[null,{"$f":"+T!C105","v":1},{"$f":"+T!D105","v":2},{"$f":"+T!E105","v":3},{"$f":"+T!F105","v":4},{"$f":"+T!G105","v":5}]
[{"$f":"+T!B106","v":"Kannattavuus"}]
[{"$f":"+T!B107","v":"Käyttökate / Myyntituotot (%)"},{"$f":"+T!C107","v":"Positiivinen"},{"$f":"+T!D107","v":"Positiivinen"},{"$f":"+T!E107","v":"Positiivinen"},{"$f":"+T!F107","v":"Positiivinen"},{"$f":"+T!G107","v":"Positiivinen"}]
[{"$f":"+T!B108","v":"Sijoitetun pääoman tuotto-%"},null,{"$f":"+T!D108","v":"Hyvä"},{"$f":"+T!E108","v":"Erinomainen"},{"$f":"+T!F108","v":"Erinomainen"},{"$f":"+T!G108","v":"Erinomainen"}]
[{"$f":"+T!B109","v":"Oman pääoman tuotto-%"},null,{"$f":"+T!D109","v":"Erinomainen"},{"$f":"+T!E109","v":"Erinomainen"},{"$f":"+T!F109","v":"Erinomainen"},{"$f":"+T!G109","v":"Erinomainen"}]
[]
[{"$f":"+T!B111","v":"Maksuvalmius"}]
[{"$f":"+T!B112","v":"Rahoitustulos / Myyntituotot"},{"$f":"+T!C112","v":"Positiivinen"},{"$f":"+T!D112","v":"Positiivinen"},{"$f":"+T!E112","v":"Positiivinen"},{"$f":"+T!F112","v":"Positiivinen"},{"$f":"+T!G112","v":"Positiivinen"}]
[{"$f":"+T!B113","v":"Quick ratio"},{"$f":"+T!C113","v":"Erinomainen"},{"$f":"+T!D113","v":"Erinomainen"},{"$f":"+T!E113","v":"Erinomainen"},{"$f":"+T!F113","v":"Erinomainen"},{"$f":"+T!G113","v":"Erinomainen"}]
[]
[{"$f":"+T!B115","v":"Vakavaraisuus"}]
[{"$f":"+T!B116","v":"Omavaraisuusaste"},{"$f":"+T!C116","v":"Heikko"},{"$f":"+T!D116","v":"Välttävä"},{"$f":"+T!E116","v":"Tyydyttävä"},{"$f":"+T!F116","v":"Hyvä"},{"$f":"+T!G116","v":"Erinomainen"}]
[{"$f":"+T!B117","v":"Rahoitustulos / Velat (%)"},{"$f":"+T!C117","v":"Välttävä"},{"$f":"+T!D117","v":"Tyydyttävä"},{"$f":"+T!E117","v":"Hyvä"},{"$f":"+T!F117","v":"Hyvä"},{"$f":"+T!G117","v":"Hyvä"}]
[]
[{"$f":"+T!B119","v":"Rahoitusriski"}]
[{"$f":"+T!B120","v":"Kolmen muuttujan P-luku"},{"$f":"+T!C120","v":"Suuri riski"},{"$f":"+T!D120","v":"Suuri riski"},{"$f":"+T!E120","v":"Kohtuullinen riski"},{"$f":"+T!F120","v":"Kohtuullinen riski"},{"$f":"+T!G120","v":"Suhteellisen pieni riski"}]
[]
[{"$f":"+T!B123","v":"LIITEKUVIOT"}]
[]
[]
[]
[]
[]
[]
[]
[]
[]
[]
[]
[]
[]
[]
[]
[]
[]
[]
[]
[]
[]
[]
[]
[]
[]
[]
[]
[]
[]
[]
[]
[]
[]
[]
[]
[]
[]
[]
[]
[]
[]
[]
[]
[]
[]
[]
[]
[]
[]
[]
[]
[]
[]
[]
[]
[]
[]
[]
[]
[]
[]
[]
[]
[]
[]
[]
[]
[]
[]
[]
[]
["Tämä raportti on suuntaa-antava laskelma siitä, miten ratsastuskoulusi voisi antamillasi lähtötiedoilla menestyä viiden ensimmäisen vuoden aikana. Tehdyt laskelmat perustuvat omiin arvioihisi esimerkiksi yrityksesi kasvusta ja velkojen korkokannoista. Laskelmissa ei ole huomioitu erikseen arvonlisäveroa. Vastuu laskelmien hyödyntämisestä on ohjelman käyttäjällä. Copyright Vaasan Yritysinformaatio Oy."]

{"sheet":"E","index":1,"n_rows":184,"n_cols":8,"rows_kept":184,"cut":false,"hidden":true,"merged":[]}
[1,{"$f":"+A1+1","v":2},{"$f":"+B1+1","v":3},4,5,6,7,8]
[" Copyright Vaasan Yritysinformaatio Oy. Kaikki tekijänoikeudet pidätetään."]
["PERUSTETTAVAN YRITYKSEN TILINPÄÄTÖSENNUSTE VIIDELLE VUODELLE"]
[]
["LIIKEVAIHDON KASVUENNUSTE"]
[null,"Lähtöoletus:",null,"Vuodet:"]
[null,null,null,1,2,3,4,5]
["Ensimmäisen vuoden liikevaihto",{"$f":"+K!F37","v":215010},null,{"$f":"+$B$8*(1+$B$9)^(D$7-1)","v":215010},{"$f":"+$B$8*(1+$B$9)^(E$7-1)","v":225760.5},237048.52499999999,248900.95125000001,261345.99881250001]
["Liikevaihdon arvioitu kasvuvauhti",{"$f":"+K!G23","v":0.05}]
["Kiinteiden kulujen arvioitu kasvuvauhti",{"$f":"+K!G24","v":0.03}]
[]
[]
["Verokanta",{"$f":"+K!G17","v":0.2}]
["Lyhytaikaisen vieraan pääoman korko-%",{"$f":"+K!G18","v":0.03}]
["Pitkäaikaisen vieraan pääoman korko-%",{"$f":"+K!G19","v":0.02}]
["Osinko-%  kertyneistä voitoista",{"$f":"+K!G21","v":0.05}]
["Pitkäaikaisen velan pituus vuosina",{"$f":"+K!G20","v":5}]
["Rahoitusomaisuus / Liikevaihto",{"$f":"+K!G22","v":0.05},"Minimitaso","Toimivien yritysten keskiarvo"]
["Vaihto-omaisuus / Liikevaihto",0,"Taso"]
["Myyntisaamisten kasvu-%",0]
["Ostovelkojen kasvu-%",0]
[]
["KASSAVIRTAENNUSTE (Euro)"]
[]
[null,null,null,{"$f":"+D7","v":1},{"$f":"+D25+1","v":2},{"$f":"+E25+1","v":3},4,5]
["Liikevaihto","%-osuus",null,{"$f":"+D8","v":215010},{"$f":"+E8","v":225760.5},{"$f":"+F8","v":237048.52499999999},{"$f":"+G8","v":248900.95125000001},{"$f":"+H8","v":261345.99881250001}]
[" - Muuttuvat kulut"]
["Karkearehu",{"$f":"+K!G45/100","v":8.3717036416910848E-2},null,{"$f":"+$B28*D$26","v":18000},18900,19845,20837.250000000004,21879.112500000003]
["Väkirehu",{"$f":"+K!G46/100","v":1.6743407283382167E-2},null,3599.9999999999995,3779.9999999999995,3968.9999999999995,4167.45,4375.8224999999993]
["Kivennäiset",{"$f":"+K!G47/100","v":1.6743407283382167E-2},null,3599.9999999999995,3779.9999999999995,3968.9999999999995,4167.45,4375.8224999999993]
["Muut ruokintakustannukset",{"$f":"+K!G48/100","v":1.6743407283382167E-2},null,3599.9999999999995,3779.9999999999995,3968.9999999999995,4167.45,4375.8224999999993]
["Kuivikekustannukset",{"$f":"+K!G49/100","v":4.1858518208455424E-2},null,9000,9450,9922.5,10418.625000000002,10939.556250000001]
["Kengitykset",{"$f":"+K!G50/100","v":2.7905678805636946E-2},null,6000,6300,6614.9999999999991,6945.75,7293.0374999999995]
["Madotukset",{"$f":"+K!G51/100","v":2.3254732338030791E-3},null,500.00000000000006,525,551.25,578.81250000000011,607.75312500000007]
["Rokotukset",{"$f":"+K!G52/100","v":4.6509464676061582E-3},null,1000.0000000000001,1050,1102.5,1157.6250000000002,1215.5062500000001]
["Raspaukset",{"$f":"+K!G53/100","v":4.6509464676061582E-3},null,1000.0000000000001,1050,1102.5,1157.6250000000002,1215.5062500000001]
["Muut eläinlääkärikulut",{"$f":"+K!G54/100","v":9.3018929352123164E-3},null,2000.0000000000002,2100,2205,2315.2500000000005,2431.0125000000003]
["Varustekustannukset",{"$f":"+K!G55/100","v":2.3254732338030788E-2},null,5000,5250,5512.4999999999991,5788.125,6077.53125]
["Ratsastuksen opettajien palkat lisineen",{"$f":"+K!G56/100","v":0.21161806427608018},null,45500,47775,50163.75,52671.9375,55305.534375000003]
["Täyshoitohevosten hoitajien palkat lisineen",{"$f":"+K!G57/100","v":5.5811357611273892E-2},null,12000,12600,13229.999999999998,13891.5,14586.074999999999]
["Muut muuttuvat kulut",{"$f":"+K!G58/100","v":9.3018929352123164E-3},null,2000.0000000000002,2100,2205,2315.2500000000005,2431.0125000000003]
[" = Myyntikate (menopohjainen)",{"$f":"+K!G59/100","v":0.4753732384540254},null,{"$f":"+D26-SUM(D28:D41)","v":102210},{"$f":"+E26-SUM(E28:E41)","v":107320.5},112686.52499999999,118320.85125000001,124236.8938125]
[" - Kiinteät kulut"]
["Vuokrakulut",{"$f":"+K!F63","v":0},null,{"$f":"+$B44*(1+$B$10)^(D$25-1)","v":0},0,0,0,0]
["Sähkökulut",{"$f":"+K!F64","v":2400},null,2400,2472,2546.16,2622.5448000000001,2701.2211439999996]
["Vesikulut",{"$f":"+K!F65","v":1200},null,1200,1236,1273.08,1311.2724000000001,1350.6105719999998]
["Pohjien huolto",{"$f":"+K!F66","v":3000},null,3000,3090,3182.7,3278.181,3376.5264299999999]
["Lantalan tyhjennys",{"$f":"+K!F67","v":1200},null,1200,1236,1273.08,1311.2724000000001,1350.6105719999998]
["Kiinteät palkkakustannukset lisineen",{"$f":"+K!F68","v":24000},null,24000,24720,25461.599999999999,26225.448,27012.211439999999]
["Muut kiinteät kulut",{"$f":"+K!F69","v":1200},null,1200,1236,1273.08,1311.2724000000001,1350.6105719999998]
[" = Käyttökate (menopohjainen)",null,null,{"$f":"+D42-SUM(D44:D50)","v":69210},{"$f":"+E42-SUM(E44:E50)","v":73330.5},77676.824999999997,82260.860249999998,87095.103082499991]
["Korkomenot","automaatti",null,{"$f":"+$B$14*C$141+$B$15*C$143","v":6000},{"$f":"+$B$14*D$141+$B$15*D$143","v":6000},{"$f":"+$B$14*E$141+$B$15*E$143","v":4920},{"$f":"+$B$14*F$141+$B$15*F$143","v":3840},{"$f":"+$B$14*G$141+$B$15*G$143","v":2760}]
["Verot","automaatti",null,{"$f":"+D121","v":6735.333333333333},{"$f":"+E121","v":7559.4333333333334},{"$f":"+F121","v":8744.6983333333319},{"$f":"+G121","v":9877.5053833333332},{"$f":"+H121","v":13560.35394983333}]
["Osingot","automaatti",null,0,{"$f":"+D149","v":1347.0666666666666},{"$f":"+E149","v":2791.6000000000004},{"$f":"+F149","v":4400.9596666666666},{"$f":"+G149","v":6156.4127600000002}]
[" = Rahoitustulos (menopohjainen)",null,null,{"$f":"+D51-SUM(D52:D54)","v":56474.666666666672},{"$f":"+E51-SUM(E52:E54)","v":58424},61220.526666666665,64142.395199999999,64618.336372666658]
[" - Investoinnit"]
["Hevosten hankinta",{"$f":"+K!F79","v":30000},{"$f":"+B57","v":30000},{"$f":"+B57","v":30000},0,0,0,0]
["Maa- ja vesialueet",{"$f":"+K!F80","v":40000},{"$f":"+B58","v":40000},{"$f":"+B58","v":40000},0,0,0,0]
["Rakennukset ja rakennelmat",{"$f":"+K!F81","v":200000},200000,200000,0,0,0,0]
["Koneet ja kalusto",{"$f":"+K!F82","v":50000},50000,50000,0,0,0,0]
["Aineeton käyttöomaisuus",{"$f":"+K!F83","v":1000},1000,1000,0,0,0,0]
["Muu käyttöomaisuus",{"$f":"+K!F84","v":1000},1000,1000,0,0,0,0]
[" - Kassavirtamuunnos"]
[" = Investointijäämä",null,null,{"$f":"+D55-SUM(D57:D63)","v":-265525.33333333331},{"$f":"+E55-SUM(E57:E63)","v":58424},{"$f":"+F55-SUM(F57:F63)","v":61220.526666666665},{"$f":"+G55-SUM(G57:G63)","v":64142.395199999999},{"$f":"+H55-SUM(H57:H63)","v":64618.336372666658}]
[" + Muun rahoitusomaisuuden vähennys","automaatti",null,{"$f":"-$B$18*D$86+C128","v":-10750.5},{"$f":"-$B$18*E$86+D128","v":23186.641666666685},{"$f":"-$B$18*F$86+E128","v":27046.240416666693},{"$f":"-$B$18*G$86+F128","v":33674.145770833355},{"$f":"-$B$18*H$86+G128","v":43194.288592708363}]
[" + Muun lyhytaikaisen vieraan pääoman lisäys",{"$f":"+K!F89","v":20000},null,{"$f":"+K!F89","v":20000},0,0,0,0]
[" + Pitkäaikaisen vieraan pääoman lisäys",{"$f":"+K!F90","v":270000},null,{"$f":"+K!F90","v":270000},{"$f":"-IF(K!$G$24<E25,$D$67/K!$G$20)","v":-54000},{"$f":"-IF(K!$G$24<F25,$D$67/K!$G$20)","v":-54000},{"$f":"-IF(K!$G$24<G25,$D$67/K!$G$20)","v":-54000},{"$f":"-IF(K!$G$24<H25,$D$67/K!$G$20)","v":-54000}]
[" + Oman pääoman lisäys",{"$f":"+K!F91","v":10000},null,{"$f":"+K!F91","v":10000},0,0,0,0]
[" - Rahoitusomaisuuden lisäys (tasoitus)","automaatti",null,{"$f":"+IF(SUM(D64:D68)>0,-SUM(D64:D68),0)","v":-23724.166666666686},{"$f":"+IF(SUM(E64:E68)>0,-SUM(E64:E68),0)","v":-27610.641666666692},-34266.767083333354,-43816.540970833361,-53812.624965375027]
[" = Netto rahoituksen jälkeen (0)",null,null,{"$f":"+SUM(D64:D69)","v":0},{"$f":"+SUM(E64:E69)","v":0},{"$f":"+SUM(F64:F69)","v":0},{"$f":"+SUM(G64:G69)","v":0},{"$f":"+SUM(H64:H69)","v":0}]
[null,null,null,{"$f":"+IF(D70=0,\" \",\"Huom! Ei 0\")","v":" "},{"$f":"+IF(E70=0,\" \",\"Huom! Ei 0\")","v":" "}," "," "," "]
[null,null,null,"Lyhytaikaisen velan"]
[null,null,null,"lisäykseen"]
[]
["Poistot:","Pitoaika","Poisto-osuus"]
[{"$f":"+A57","v":"Hevosten hankinta"},{"$f":"+K!F10","v":10},{"$f":"+K!G10","v":0.1}]
["Maa- ja vesialueet",0,0]
["Rakennukset ja rakennelmat",{"$f":"+K!F11","v":15},{"$f":"+K!G11","v":6.6666666666666666E-2}]
["Koneet ja kalusto",{"$f":"+K!F12","v":4},{"$f":"+K!G12","v":0.25}]
["Aineeton käyttöomaisuus",{"$f":"+K!F13","v":5},{"$f":"+K!G13","v":0.2}]
["Muu käyttöomaisuus",{"$f":"+K!F14","v":2},{"$f":"+K!G14","v":0.5}]
[]
["TULOSLASKELMAENNUSTE (Euro)"]
[null,null,null,"Ennusteet:"]
[null,null,null,{"$f":"+D25","v":1},2,3,4,5]
["Liikevaihto",null,null,215010,225760.5,237048.52499999999,248900.95125000001,261345.99881250001]
[" - Muuttuvat kulut"]
["Karkearehu",null,null,{"$f":"+D28","v":18000},18900,19845,20837.250000000004,21879.112500000003]
["Väkirehu",null,null,3599.9999999999995,3779.9999999999995,3968.9999999999995,4167.45,4375.8224999999993]
["Kivennäiset",null,null,3599.9999999999995,3779.9999999999995,3968.9999999999995,4167.45,4375.8224999999993]
["Muut ruokintakustannukset",null,null,3599.9999999999995,3779.9999999999995,3968.9999999999995,4167.45,4375.8224999999993]
["Kuivikekustannukset",null,null,9000,9450,9922.5,10418.625000000002,10939.556250000001]
["Kengitykset",null,null,6000,6300,6614.9999999999991,6945.75,7293.0374999999995]
["Madotukset",null,null,500.00000000000006,525,551.25,578.81250000000011,607.75312500000007]
["Rokotukset",null,null,1000.0000000000001,1050,1102.5,1157.6250000000002,1215.5062500000001]
["Raspaukset",null,null,1000.0000000000001,1050,1102.5,1157.6250000000002,1215.5062500000001]
["Muut eläinlääkärikulut",null,null,2000.0000000000002,2100,2205,2315.2500000000005,2431.0125000000003]
["Varustekustannukset",null,null,5000,5250,5512.4999999999991,5788.125,6077.53125]
["Ratsastuksen opettajien palkat lisineen",null,null,45500,47775,50163.75,52671.9375,55305.534375000003]
["Täyshoitohevosten hoitajien palkat lisineen",null,null,{"$f":"+D40","v":12000},12600,13229.999999999998,13891.5,14586.074999999999]
["Muut muuttuvat kulut",null,null,{"$f":"+D41","v":2000.0000000000002},2100,2205,2315.2500000000005,2431.0125000000003]
[" = Myyntikate",null,null,{"$f":"+D86-SUM(D88:D101)","v":102210},{"$f":"+E86-SUM(E88:E101)","v":107320.5},{"$f":"+F86-SUM(F88:F101)","v":112686.52499999999},{"$f":"+G86-SUM(G88:G101)","v":118320.85125000001},{"$f":"+H86-SUM(H88:H101)","v":124236.8938125}]
[" - Kiinteät kulut"]
["Vuokrakulut",null,null,{"$f":"+D44","v":0},0,0,0,0]
["Sähkökulut",null,null,2400,2472,2546.16,2622.5448000000001,2701.2211439999996]
["Vesikulut",null,null,1200,1236,1273.08,1311.2724000000001,1350.6105719999998]
["Pohjien huolto",null,null,3000,3090,3182.7,3278.181,3376.5264299999999]
["Lantalan tyhjennys",null,null,1200,1236,1273.08,1311.2724000000001,1350.6105719999998]
["Kiinteät palkkakustannukset lisineen",null,null,24000,24720,25461.599999999999,26225.448,27012.211439999999]
["Muut kiinteät kulut",null,null,{"$f":"+D50","v":1200},1236,1273.08,1311.2724000000001,1350.6105719999998]
[" = Käyttökate",null,null,{"$f":"+D102-SUM(D104:D110)","v":69210},{"$f":"+E102-SUM(E104:E110)","v":73330.5},77676.824999999997,82260.860249999998,87095.103082499991]
[" - Poistot"]
[{"$f":"+A57","v":"Hevosten hankinta"},null,{"$f":"+C57","v":30000},{"$f":"+IF(D$85>$B76,0,$C76*$C113)","v":3000},3000,3000,3000,3000]
["Maa- ja vesialueet",null,40000,0,0,0,0,0]
["Rakennukset ja rakennelmat",null,200000,13333.333333333334,13333.333333333334,13333.333333333334,13333.333333333334,13333.333333333334]
["Koneet ja kalusto",null,50000,12500,12500,12500,12500,0]
["Aineeton käyttöomaisuus",null,1000,200,200,200,200,200]
["Muu käyttöomaisuus",null,1000,500,500,0,0,0]
[" = Liiketulos",null,null,{"$f":"+D111-SUM(D113:D118)","v":39676.666666666664},{"$f":"+E111-SUM(E113:E118)","v":43797.166666666664},48643.491666666661,53227.526916666662,70561.769749166648]
[" - Korkokulut",null,null,{"$f":"+D52","v":6000},{"$f":"+E52","v":6000},{"$f":"+F52","v":4920},{"$f":"+G52","v":3840},{"$f":"+H52","v":2760}]
[" - Verot",null,null,{"$f":"+IF((D119-D120)>0,$B$13*(D119-D120),0)","v":6735.333333333333},{"$f":"+IF((E119-E120)>0,$B$13*(E119-E120),0)","v":7559.4333333333334},8744.6983333333319,9877.5053833333332,13560.35394983333]
["Tilikauden tulos",null,null,{"$f":"+D119-SUM(D120:D121)","v":26941.333333333332},{"$f":"+E119-SUM(E120:E121)","v":30237.73333333333},34978.793333333328,39510.021533333333,54241.415799333321]
[]
["TASE-ENNUSTE (Euro)"]
[]
["Taseen omaisuus",null,null,"Ennusteet:"]
["Lyhytaikainen:",null,null,{"$f":"+D85","v":1},{"$f":"+E85","v":2},{"$f":"+F85","v":3},{"$f":"+G85","v":4},{"$f":"+H85","v":5}]
["Rahoitusomaisuus",null,null,{"$f":"+$B$18*D86-D69","v":34474.666666666686},{"$f":"+$B$18*E86-E69","v":38898.666666666693},{"$f":"+$B$18*F86-F69","v":46119.193333333358},{"$f":"+$B$18*G86-G69","v":56261.588533333364},{"$f":"+$B$18*H86-H69","v":66879.924906000029}]
["Pitkäaikainen:"]
[{"$f":"+A57","v":"Hevosten hankinta"},null,{"$f":"+C57","v":30000},{"$f":"+C130-D113","v":27000},{"$f":"+D130-E113+E57","v":24000},21000,18000,15000]
["Maa- ja vesialueet",null,40000,40000,40000,40000,40000,40000]
["Rakennukset ja rakennelmat",null,200000,186666.66666666666,173333.33333333331,159999.99999999997,146666.66666666663,133333.33333333328]
["Koneet ja kalusto",null,50000,37500,25000,12500,0,0]
["Aineeton käyttöomaisuus",null,1000,800,600,400,200,0]
["Muu käyttöomaisuus",null,1000,500,0,0,0,0]
["Yhteensä",null,null,{"$f":"+D128+SUM(D130:D135)","v":326941.33333333331},{"$f":"+E128+SUM(E130:E135)","v":301832},{"$f":"+F128+SUM(F130:F135)","v":280019.19333333336},{"$f":"+G128+SUM(G130:G135)","v":261128.25519999999},{"$f":"+H128+SUM(H130:H135)","v":255213.25823933331}]
[]
["Taseen pääoma"]
["Lyhytaikainen:"]
["Lyhytaikaiset velat (maks. voitto-osuus)",null,null,{"$f":"+D149","v":1347.0666666666666},{"$f":"+E149","v":2791.6000000000004},4400.9596666666666,6156.4127600000002,8560.6629119666668]
["Muu lyhytaikainen vieras pääoma",null,{"$f":"+B66","v":20000},{"$f":"+C141-D70","v":20000},{"$f":"+D141-E70","v":20000},{"$f":"+E141-F70","v":20000},{"$f":"+F141-G70","v":20000},{"$f":"+G141-H70","v":20000}]
["Pitkäaikainen:"]
["Pitkäaikainen vieras pääoma",null,{"$f":"+B67","v":270000},{"$f":"+C143","v":270000},{"$f":"+D143+E67","v":216000},162000,108000,54000]
["Sijoitettu oma pääoma",null,{"$f":"+B68","v":10000},{"$f":"+C144","v":10000},10000,10000,10000,10000]
["Kertyneet voittovarat ja muu oma pääoma",null,{"$f":"+D122","v":26941.333333333332},{"$f":"+C145-D149","v":25594.266666666666},{"$f":"+D145+E122-E149","v":53040.4},{"$f":"+E145+F122-F149","v":83618.233666666667},{"$f":"+F145+G122-G149","v":116971.84243999999},{"$f":"+G145+H122-H149","v":162652.59532736664}]
["Yhteensä",null,null,{"$f":"+SUM(D140:D145)","v":326941.33333333331},301832,280019.19333333336,261128.25520000001,255213.25823933331]
[]
["Lisätietoja:",null,null,"Laskettu:"]
["Osingot kertyneistä voitoista",{"$f":"+B16","v":0.05},null,{"$f":"+IF(C145-$B149*C145>0,$B149*C145,IF(C145>0,C145,0))","v":1347.0666666666666},{"$f":"+IF(D145-$B149*D145+E122>0,$B149*(D145+E122),IF(D145+E122>0,D145+E122,0))","v":2791.6000000000004},{"$f":"+IF(E145-$B149*E145+F122>0,$B149*(E145+F122),IF(E145+F122>0,E145+F122,0))","v":4400.9596666666666},{"$f":"+IF(F145-$B149*F145+G122>0,$B149*(F145+G122),IF(F145+G122>0,F145+G122,0))","v":6156.4127600000002},{"$f":"+IF(G145-$B149*G145+H122>0,$B149*(G145+H122),IF(G145+H122>0,G145+H122,0))","v":8560.6629119666668}]
[]
[null,null,"Tarkistus",{"$f":"0.05*(D145+D140)","v":1347.0666666666666},{"$f":"0.05*(E145+E140)","v":2791.6000000000004},4400.9596666666666,6156.4127600000002,8560.6629119666668]
[]
[]
["TILINPÄÄTÖKSEN TUNNUSLUVUT"]
[null,null,null,{"$f":"+D25","v":1},{"$f":"+E25","v":2},{"$f":"+F25","v":3},{"$f":"+G25","v":4},{"$f":"+H25","v":5}]
["Koko"]
["1. Liikevaihto (Euro)",null,null,{"$f":"+D86","v":215010},{"$f":"+E86","v":225760.5},{"$f":"+F86","v":237048.52499999999},{"$f":"+G86","v":248900.95125000001},{"$f":"+H86","v":261345.99881250001}]
["2. Taseen loppusumma (Euro)",null,null,{"$f":"+D136","v":326941.33333333331},{"$f":"+E136","v":301832},{"$f":"+F136","v":280019.19333333336},{"$f":"+G136","v":261128.25519999999},{"$f":"+H136","v":255213.25823933331}]
["3. Tilikauden tulos (Euro)",null,null,{"$f":"+D122","v":26941.333333333332},{"$f":"+E122","v":30237.73333333333},{"$f":"+F122","v":34978.793333333328},{"$f":"+G122","v":39510.021533333333},{"$f":"+H122","v":54241.415799333321}]
["4. Voitto-osuus omistajalle (Euro)",null,null,{"$f":"+D149","v":1347.0666666666666},{"$f":"+E149","v":2791.6000000000004},4400.9596666666666,6156.4127600000002,8560.6629119666668]
[]
["Kasvu"]
["1. Liikevaihdon kasvu-%",null,null,null,{"$f":"100*E86/D86-100","v":5},{"$f":"100*F86/E86-100","v":5},{"$f":"100*G86/F86-100","v":5},{"$f":"100*H86/G86-100","v":5}]
["2. Taseen loppusumman kasvu-%",null,null,null,{"$f":"100*E136/D136-100","v":-7.6800730814090912},{"$f":"100*F136/E136-100","v":-7.2268038732363209},{"$f":"100*G136/F136-100","v":-6.7463011761646214},{"$f":"100*H136/G136-100","v":-2.2651692579710812}]
["3. Tilikauden tuloksen kasvu-%",null,null,null,{"$f":"100*(E122)/(D122)-100","v":12.23547461150153},{"$f":"100*(F122)/(E122)-100","v":15.679283720561045},{"$f":"100*(G122)/(F122)-100","v":12.954215306455225},{"$f":"100*(H122)/(G122)-100","v":37.285209408381576}]
[]
["Kannattavuus"]
["1. Käyttökate / Liikevaihto (%)",null,null,{"$f":"100*D111/D86","v":32.189200502302221},{"$f":"100*E111/E86","v":32.481545708837466},{"$f":"100*F111/F86","v":32.76832243524823},{"$f":"100*G111/G86","v":33.049636747822589},{"$f":"100*H111/H86","v":33.3255926925384}]
["2. Liiketulos / Liikevaihto (%)",null,null,{"$f":"100*D119/D86","v":18.45340526797203},{"$f":"100*E119/E86","v":19.399835961856329},{"$f":"100*F119/F86","v":20.520478525089604},{"$f":"100*G119/G86","v":21.385023500052476},{"$f":"100*H119/H86","v":26.999368679751804}]
["3. Tilikauden tulos / Liikevaihto (%)",null,null,{"$f":"100*D122/D86","v":12.530269909926668},{"$f":"100*E122/E86","v":13.393721812865108},{"$f":"100*F122/F86","v":14.755963292044667},{"$f":"100*G122/G86","v":15.873792902321554},{"$f":"100*H122/H86","v":20.754637930480914}]
["4. Sijoitetun pääoman tuotto-%",null,null,null,{"$f":"100*(E122+E121+E120)/D136","v":13.396032315685586},{"$f":"100*(F122+F121+F120)/E136","v":16.116081683408868},{"$f":"100*(G122+G121+G120)/F136","v":19.00852805232708},{"$f":"100*(H122+H121+H120)/G136","v":27.021882291184035}]
["5. Oman pääoman tuotto-%",null,null,null,{"$f":"+IF(D144+D145>0,100*(E122)/(D144+D145),\"\")","v":84.951134452364983},{"$f":"+IF(E144+E145>0,100*(F122)/(E144+E145),\"\")","v":55.486312481096768},42.203340082244161,42.719247635525868]
[]
["Maksuvalmius"]
["1. Rahoitustulos / Liikevaihto",null,null,{"$f":"100*(D122+SUM(D113:D118))/D86","v":26.266065144256856},{"$f":"100*(E122+SUM(E113:E118))/E86","v":26.475431559846239},{"$f":"100*(F122+SUM(F113:F118))/F86","v":27.003807202203287},{"$f":"100*(G122+SUM(G113:G118))/G86","v":27.538406150091667},{"$f":"100*(H122+SUM(H113:H118))/H86","v":27.080861943267504}]
["2. Quick ratio",null,null,{"$f":"+(D128)/(D140+D141)","v":1.6149603692622885},{"$f":"+(E128)/(E140+E141)","v":1.7067106594827346},1.8900565372572311,2.1509673000485776,2.341679712132239]
[]
["Vakavaraisuus"]
["1. Omavaraisuusaste",null,null,{"$f":"100*(D144+D145)/D146","v":10.887050072184204},{"$f":"100*(E144+E145)/E146","v":20.885923295078058},33.432791714110834,48.624321539908173,67.650323701230619]
["2. Rahoitustulos / Velat (%)",null,null,{"$f":"100*(D122+SUM(D113:D118))/(+D140+D141+D143)","v":19.383983272184427},{"$f":"100*(E122+SUM(E113:E118))/(+E140+E141+E143)","v":25.030640385451861},34.341092868372016,51.09211960615535,85.724540763599265]
[]
["Rahoitusriski"]
["1. Kolmen muuttujan P-luku ","Kriittinen arvo P* = 0,50",null,{"$f":"1/(1+EXP(-(0.843-0.027*D179-0.039*D176-0.01*D175)))","v":0.55562024372303342},{"$f":"1/(1+EXP(-(0.843-0.027*E179-0.039*E176-0.01*E175)))","v":0.48694397851049387},{"$f":"1/(1+EXP(-(0.843-0.027*F179-0.039*F176-0.01*F175)))","v":0.40048716786581695},{"$f":"1/(1+EXP(-(0.843-0.027*G179-0.039*G176-0.01*G175)))","v":0.3038293826107476},{"$f":"1/(1+EXP(-(0.843-0.027*H179-0.039*H176-0.01*H175)))","v":0.20657542726185887}]
[null,"Tulkintalause",null,{"$f":"+IF(D183>0.65,\"Erittäin suuri riski\",IF(D183>0.45,\"Suuri riski\",IF(D183>0.25,\"Kohtuullinen riski\",IF(D183>0.1,\"Suhteellisen pieni riski\",\"Pieni riski\"))))","v":"Suuri riski"},{"$f":"+IF(E183>0.65,\"Erittäin suuri riski\",IF(E183>0.45,\"Suuri riski\",IF(E183>0.25,\"Kohtuullinen riski\",IF(E183>0.1,\"Suhteellisen pieni riski\",\"Pieni riski\"))))","v":"Suuri riski"},"Kohtuullinen riski","Kohtuullinen riski","Suhteellisen pieni riski"]

{"sheet":"T","index":2,"n_rows":167,"n_cols":15,"rows_kept":167,"cut":false,"hidden":true,"merged":[]}
[null," Copyright Vaasan Yritysinformaatio Oy. Kaikki tekijänoikeudet pidätetään."]
[]
[null,"ENNAKOITU TULOSLASKELMA"]
[null,null,"Ennakoidut viisi vuotta:"]
[null,null,1,2,3,4,5]
[null,{"$f":"+E!A86","v":"Liikevaihto"},{"$f":"+E!D86","v":215010},{"$f":"+E!E86","v":225760.5},{"$f":"+E!F86","v":237048.52499999999},{"$f":"+E!G86","v":248900.95125000001},{"$f":"+E!H86","v":261345.99881250001}]
[null,{"$f":"+E!A87","v":" - Muuttuvat kulut"}]
[null,{"$f":"+E!A88","v":"Karkearehu"},{"$f":"+E!D88","v":18000},{"$f":"+E!E88","v":18900},{"$f":"+E!F88","v":19845},{"$f":"+E!G88","v":20837.250000000004},{"$f":"+E!H88","v":21879.112500000003}]
[null,{"$f":"+E!A89","v":"Väkirehu"},{"$f":"+E!D89","v":3599.9999999999995},{"$f":"+E!E89","v":3779.9999999999995},{"$f":"+E!F89","v":3968.9999999999995},{"$f":"+E!G89","v":4167.45},{"$f":"+E!H89","v":4375.8224999999993}]
[null,{"$f":"+E!A90","v":"Kivennäiset"},{"$f":"+E!D90","v":3599.9999999999995},{"$f":"+E!E90","v":3779.9999999999995},{"$f":"+E!F90","v":3968.9999999999995},{"$f":"+E!G90","v":4167.45},{"$f":"+E!H90","v":4375.8224999999993}]
[null,{"$f":"+E!A91","v":"Muut ruokintakustannukset"},{"$f":"+E!D91","v":3599.9999999999995},{"$f":"+E!E91","v":3779.9999999999995},{"$f":"+E!F91","v":3968.9999999999995},{"$f":"+E!G91","v":4167.45},{"$f":"+E!H91","v":4375.8224999999993}]
[null,{"$f":"+E!A92","v":"Kuivikekustannukset"},{"$f":"+E!D92","v":9000},{"$f":"+E!E92","v":9450},{"$f":"+E!F92","v":9922.5},{"$f":"+E!G92","v":10418.625000000002},{"$f":"+E!H92","v":10939.556250000001}]
[null,{"$f":"+E!A93","v":"Kengitykset"},{"$f":"+E!D93","v":6000},{"$f":"+E!E93","v":6300},{"$f":"+E!F93","v":6614.9999999999991},{"$f":"+E!G93","v":6945.75},{"$f":"+E!H93","v":7293.0374999999995}]
[null,{"$f":"+E!A94","v":"Madotukset"},{"$f":"+E!D94","v":500.00000000000006},{"$f":"+E!E94","v":525},{"$f":"+E!F94","v":551.25},{"$f":"+E!G94","v":578.81250000000011},{"$f":"+E!H94","v":607.75312500000007}]
[null,{"$f":"+E!A95","v":"Rokotukset"},{"$f":"+E!D95","v":1000.0000000000001},{"$f":"+E!E95","v":1050},{"$f":"+E!F95","v":1102.5},{"$f":"+E!G95","v":1157.6250000000002},{"$f":"+E!H95","v":1215.5062500000001}]
[null,{"$f":"+E!A96","v":"Raspaukset"},{"$f":"+E!D96","v":1000.0000000000001},{"$f":"+E!E96","v":1050},{"$f":"+E!F96","v":1102.5},{"$f":"+E!G96","v":1157.6250000000002},{"$f":"+E!H96","v":1215.5062500000001}]
[null,{"$f":"+E!A97","v":"Muut eläinlääkärikulut"},{"$f":"+E!D97","v":2000.0000000000002},{"$f":"+E!E97","v":2100},{"$f":"+E!F97","v":2205},{"$f":"+E!G97","v":2315.2500000000005},{"$f":"+E!H97","v":2431.0125000000003}]
[null,{"$f":"+E!A98","v":"Varustekustannukset"},{"$f":"+E!D98","v":5000},{"$f":"+E!E98","v":5250},{"$f":"+E!F98","v":5512.4999999999991},{"$f":"+E!G98","v":5788.125},{"$f":"+E!H98","v":6077.53125}]
[null,{"$f":"+E!A99","v":"Ratsastuksen opettajien palkat lisineen"},{"$f":"+E!D99","v":45500},{"$f":"+E!E99","v":47775},{"$f":"+E!F99","v":50163.75},{"$f":"+E!G99","v":52671.9375},{"$f":"+E!H99","v":55305.534375000003}]
[null,{"$f":"+E!A100","v":"Täyshoitohevosten hoitajien palkat lisineen"},{"$f":"+E!D100","v":12000},{"$f":"+E!E100","v":12600},{"$f":"+E!F100","v":13229.999999999998},{"$f":"+E!G100","v":13891.5},{"$f":"+E!H100","v":14586.074999999999}]
[null,{"$f":"+E!A101","v":"Muut muuttuvat kulut"},{"$f":"+E!D101","v":2000.0000000000002},{"$f":"+E!E101","v":2100},{"$f":"+E!F101","v":2205},{"$f":"+E!G101","v":2315.2500000000005},{"$f":"+E!H101","v":2431.0125000000003}]
[null,{"$f":"+E!A102","v":" = Myyntikate"},{"$f":"+E!D102","v":102210},{"$f":"+E!E102","v":107320.5},{"$f":"+E!F102","v":112686.52499999999},{"$f":"+E!G102","v":118320.85125000001},{"$f":"+E!H102","v":124236.8938125}]
[null,{"$f":"+E!A103","v":" - Kiinteät kulut"}]
[null,{"$f":"+E!A104","v":"Vuokrakulut"},{"$f":"+E!D104","v":0},{"$f":"+E!E104","v":0},{"$f":"+E!F104","v":0},{"$f":"+E!G104","v":0},{"$f":"+E!H104","v":0}]
[null,{"$f":"+E!A105","v":"Sähkökulut"},{"$f":"+E!D105","v":2400},{"$f":"+E!E105","v":2472},{"$f":"+E!F105","v":2546.16},{"$f":"+E!G105","v":2622.5448000000001},{"$f":"+E!H105","v":2701.2211439999996}]
[null,{"$f":"+E!A106","v":"Vesikulut"},{"$f":"+E!D106","v":1200},{"$f":"+E!E106","v":1236},{"$f":"+E!F106","v":1273.08},{"$f":"+E!G106","v":1311.2724000000001},{"$f":"+E!H106","v":1350.6105719999998}]
[null,{"$f":"+E!A107","v":"Pohjien huolto"},{"$f":"+E!D107","v":3000},{"$f":"+E!E107","v":3090},{"$f":"+E!F107","v":3182.7},{"$f":"+E!G107","v":3278.181},{"$f":"+E!H107","v":3376.5264299999999}]
[null,{"$f":"+E!A108","v":"Lantalan tyhjennys"},{"$f":"+E!D108","v":1200},{"$f":"+E!E108","v":1236},{"$f":"+E!F108","v":1273.08},{"$f":"+E!G108","v":1311.2724000000001},{"$f":"+E!H108","v":1350.6105719999998}]
[null,{"$f":"+E!A109","v":"Kiinteät palkkakustannukset lisineen"},{"$f":"+E!D109","v":24000},{"$f":"+E!E109","v":24720},{"$f":"+E!F109","v":25461.599999999999},{"$f":"+E!G109","v":26225.448},{"$f":"+E!H109","v":27012.211439999999}]
[null,"Muut kiinteät kulut",{"$f":"+E!D110","v":1200},{"$f":"+E!E110","v":1236},{"$f":"+E!F110","v":1273.08},{"$f":"+E!G110","v":1311.2724000000001},{"$f":"+E!H110","v":1350.6105719999998}]
[null,{"$f":"+E!A111","v":" = Käyttökate"},{"$f":"+E!D111","v":69210},{"$f":"+E!E111","v":73330.5},{"$f":"+E!F111","v":77676.824999999997},{"$f":"+E!G111","v":82260.860249999998},{"$f":"+E!H111","v":87095.103082499991}]
[null,{"$f":"+E!A112","v":" - Poistot"}]
[null,{"$f":"+E!A113","v":"Hevosten hankinta"},{"$f":"+E!D113","v":3000},{"$f":"+E!E113","v":3000},{"$f":"+E!F113","v":3000},{"$f":"+E!G113","v":3000},{"$f":"+E!H113","v":3000}]
[null,{"$f":"+E!A114","v":"Maa- ja vesialueet"},{"$f":"+E!D114","v":0},{"$f":"+E!E114","v":0},{"$f":"+E!F114","v":0},{"$f":"+E!G114","v":0},{"$f":"+E!H114","v":0}]
[null,{"$f":"+E!A115","v":"Rakennukset ja rakennelmat"},{"$f":"+E!D115","v":13333.333333333334},{"$f":"+E!E115","v":13333.333333333334},{"$f":"+E!F115","v":13333.333333333334},{"$f":"+E!G115","v":13333.333333333334},{"$f":"+E!H115","v":13333.333333333334}]
[null,{"$f":"+E!A116","v":"Koneet ja kalusto"},{"$f":"+E!D116","v":12500},{"$f":"+E!E116","v":12500},{"$f":"+E!F116","v":12500},{"$f":"+E!G116","v":12500},{"$f":"+E!H116","v":0}]
[null,{"$f":"+E!A117","v":"Aineeton käyttöomaisuus"},{"$f":"+E!D117","v":200},{"$f":"+E!E117","v":200},{"$f":"+E!F117","v":200},{"$f":"+E!G117","v":200},{"$f":"+E!H117","v":200}]
[null,{"$f":"+E!A118","v":"Muu käyttöomaisuus"},{"$f":"+E!D118","v":500},{"$f":"+E!E118","v":500},{"$f":"+E!F118","v":0},{"$f":"+E!G118","v":0},{"$f":"+E!H118","v":0}]
[null,{"$f":"+E!A119","v":" = Liiketulos"},{"$f":"+E!D119","v":39676.666666666664},{"$f":"+E!E119","v":43797.166666666664},{"$f":"+E!F119","v":48643.491666666661},{"$f":"+E!G119","v":53227.526916666662},{"$f":"+E!H119","v":70561.769749166648}]
[null,{"$f":"+E!A120","v":" - Korkokulut"},{"$f":"+E!D120","v":6000},{"$f":"+E!E120","v":6000},{"$f":"+E!F120","v":4920},{"$f":"+E!G120","v":3840},{"$f":"+E!H120","v":2760}]
[null,{"$f":"+E!A121","v":" - Verot"},{"$f":"+E!D121","v":6735.333333333333},{"$f":"+E!E121","v":7559.4333333333334},{"$f":"+E!F121","v":8744.6983333333319},{"$f":"+E!G121","v":9877.5053833333332},{"$f":"+E!H121","v":13560.35394983333}]
[null,{"$f":"+E!A122","v":"Tilikauden tulos"},{"$f":"+E!D122","v":26941.333333333332},{"$f":"+E!E122","v":30237.73333333333},{"$f":"+E!F122","v":34978.793333333328},{"$f":"+E!G122","v":39510.021533333333},{"$f":"+E!H122","v":54241.415799333321}]
[]
[null,"ENNAKOITU TASE"]
[null,null,{"$f":"+C4","v":"Ennakoidut viisi vuotta:"}]
[null,null,1,2,3,4,5]
[null,{"$f":"+E!A126","v":"Taseen omaisuus"}]
[null,{"$f":"+E!A127","v":"Lyhytaikainen:"}]
[null,{"$f":"+E!A128","v":"Rahoitusomaisuus"},{"$f":"+E!D128","v":34474.666666666686},{"$f":"+E!E128","v":38898.666666666693},{"$f":"+E!F128","v":46119.193333333358},{"$f":"+E!G128","v":56261.588533333364},{"$f":"+E!H128","v":66879.924906000029}]
[null,{"$f":"+E!A129","v":"Pitkäaikainen:"}]
[null,{"$f":"+E!A130","v":"Hevosten hankinta"},{"$f":"+E!D130","v":27000},{"$f":"+E!E130","v":24000},{"$f":"+E!F130","v":21000},{"$f":"+E!G130","v":18000},{"$f":"+E!H130","v":15000}]
[null,{"$f":"+E!A131","v":"Maa- ja vesialueet"},{"$f":"+E!D131","v":40000},{"$f":"+E!E131","v":40000},{"$f":"+E!F131","v":40000},{"$f":"+E!G131","v":40000},{"$f":"+E!H131","v":40000}]
[null,{"$f":"+E!A132","v":"Rakennukset ja rakennelmat"},{"$f":"+E!D132","v":186666.66666666666},{"$f":"+E!E132","v":173333.33333333331},{"$f":"+E!F132","v":159999.99999999997},{"$f":"+E!G132","v":146666.66666666663},{"$f":"+E!H132","v":133333.33333333328}]
[null,{"$f":"+E!A133","v":"Koneet ja kalusto"},{"$f":"+E!D133","v":37500},{"$f":"+E!E133","v":25000},{"$f":"+E!F133","v":12500},{"$f":"+E!G133","v":0},{"$f":"+E!H133","v":0}]
[null,{"$f":"+E!A134","v":"Aineeton käyttöomaisuus"},{"$f":"+E!D134","v":800},{"$f":"+E!E134","v":600},{"$f":"+E!F134","v":400},{"$f":"+E!G134","v":200},{"$f":"+E!H134","v":0}]
[null,{"$f":"+E!A135","v":"Muu käyttöomaisuus"},{"$f":"+E!D135","v":500},{"$f":"+E!E135","v":0},{"$f":"+E!F135","v":0},{"$f":"+E!G135","v":0},{"$f":"+E!H135","v":0}]
[null,{"$f":"+E!A136","v":"Yhteensä"},{"$f":"+E!D136","v":326941.33333333331},{"$f":"+E!E136","v":301832},{"$f":"+E!F136","v":280019.19333333336},{"$f":"+E!G136","v":261128.25519999999},{"$f":"+E!H136","v":255213.25823933331}]
[]
[null,{"$f":"+E!A138","v":"Taseen pääoma"}]
[null,{"$f":"+E!A139","v":"Lyhytaikainen:"}]
[null,{"$f":"+E!A140","v":"Lyhytaikaiset velat (maks. voitto-osuus)"},{"$f":"+E!D140","v":1347.0666666666666},{"$f":"+E!E140","v":2791.6000000000004},{"$f":"+E!F140","v":4400.9596666666666},{"$f":"+E!G140","v":6156.4127600000002},{"$f":"+E!H140","v":8560.6629119666668}]
[null,{"$f":"+E!A141","v":"Muu lyhytaikainen vieras pääoma"},{"$f":"+E!D141","v":20000},{"$f":"+E!E141","v":20000},{"$f":"+E!F141","v":20000},{"$f":"+E!G141","v":20000},{"$f":"+E!H141","v":20000}]
[null,{"$f":"+E!A142","v":"Pitkäaikainen:"}]
[null,{"$f":"+E!A143","v":"Pitkäaikainen vieras pääoma"},{"$f":"+E!D143","v":270000},{"$f":"+E!E143","v":216000},{"$f":"+E!F143","v":162000},{"$f":"+E!G143","v":108000},{"$f":"+E!H143","v":54000}]
[null,{"$f":"+E!A144","v":"Sijoitettu oma pääoma"},{"$f":"+E!D144","v":10000},{"$f":"+E!E144","v":10000},{"$f":"+E!F144","v":10000},{"$f":"+E!G144","v":10000},{"$f":"+E!H144","v":10000}]
[null,{"$f":"+E!A145","v":"Kertyneet voittovarat ja muu oma pääoma"},{"$f":"+E!D145","v":25594.266666666666},{"$f":"+E!E145","v":53040.4},{"$f":"+E!F145","v":83618.233666666667},{"$f":"+E!G145","v":116971.84243999999},{"$f":"+E!H145","v":162652.59532736664}]
[null,{"$f":"+E!A146","v":"Yhteensä"},{"$f":"+E!D146","v":326941.33333333331},{"$f":"+E!E146","v":301832},{"$f":"+E!F146","v":280019.19333333336},{"$f":"+E!G146","v":261128.25520000001},{"$f":"+E!H146","v":255213.25823933331}]
[]
[null,"ENNAKOIDUT TUNNUSLUVUT"]
[null,null,{"$f":"+C4","v":"Ennakoidut viisi vuotta:"}]
[null,null,{"$f":"+E!D155","v":1},{"$f":"+E!E155","v":2},{"$f":"+E!F155","v":3},{"$f":"+E!G155","v":4},{"$f":"+E!H155","v":5}]
[null,"Koko"]
[null,{"$f":"+E!A157","v":"1. Liikevaihto (Euro)"},{"$f":"+E!D157","v":215010},{"$f":"+E!E157","v":225760.5},{"$f":"+E!F157","v":237048.52499999999},{"$f":"+E!G157","v":248900.95125000001},{"$f":"+E!H157","v":261345.99881250001}]
[null,{"$f":"+E!A158","v":"2. Taseen loppusumma (Euro)"},{"$f":"+E!D158","v":326941.33333333331},{"$f":"+E!E158","v":301832},{"$f":"+E!F158","v":280019.19333333336},{"$f":"+E!G158","v":261128.25519999999},{"$f":"+E!H158","v":255213.25823933331}]
[null,{"$f":"+E!A159","v":"3. Tilikauden tulos (Euro)"},{"$f":"+E!D159","v":26941.333333333332},{"$f":"+E!E159","v":30237.73333333333},{"$f":"+E!F159","v":34978.793333333328},{"$f":"+E!G159","v":39510.021533333333},{"$f":"+E!H159","v":54241.415799333321}]
[null,{"$f":"+E!A160","v":"4. Voitto-osuus omistajalle (Euro)"},{"$f":"+E!D160","v":1347.0666666666666},{"$f":"+E!E160","v":2791.6000000000004},{"$f":"+E!F160","v":4400.9596666666666},{"$f":"+E!G160","v":6156.4127600000002},{"$f":"+E!H160","v":8560.6629119666668}]
[]
[null,{"$f":"+E!A162","v":"Kasvu"}]
[null,{"$f":"+E!A163","v":"1. Liikevaihdon kasvu-%"},null,{"$f":"+E!E163","v":5},{"$f":"+E!F163","v":5},{"$f":"+E!G163","v":5},{"$f":"+E!H163","v":5}]
[null,{"$f":"+E!A164","v":"2. Taseen loppusumman kasvu-%"},null,{"$f":"+E!E164","v":-7.6800730814090912},{"$f":"+E!F164","v":-7.2268038732363209},{"$f":"+E!G164","v":-6.7463011761646214},{"$f":"+E!H164","v":-2.2651692579710812}]
[null,{"$f":"+E!A165","v":"3. Tilikauden tuloksen kasvu-%"},null,{"$f":"+E!E165","v":12.23547461150153},{"$f":"+E!F165","v":15.679283720561045},{"$f":"+E!G165","v":12.954215306455225},{"$f":"+E!H165","v":37.285209408381576}]
[]
[null,{"$f":"+E!A167","v":"Kannattavuus"}]
[null,{"$f":"+E!A168","v":"1. Käyttökate / Liikevaihto (%)"},{"$f":"+E!D168","v":32.189200502302221},{"$f":"+E!E168","v":32.481545708837466},{"$f":"+E!F168","v":32.76832243524823},{"$f":"+E!G168","v":33.049636747822589},{"$f":"+E!H168","v":33.3255926925384}]
[null,{"$f":"+E!A169","v":"2. Liiketulos / Liikevaihto (%)"},{"$f":"+E!D169","v":18.45340526797203},{"$f":"+E!E169","v":19.399835961856329},{"$f":"+E!F169","v":20.520478525089604},{"$f":"+E!G169","v":21.385023500052476},{"$f":"+E!H169","v":26.999368679751804}]
[null,{"$f":"+E!A170","v":"3. Tilikauden tulos / Liikevaihto (%)"},{"$f":"+E!D170","v":12.530269909926668},{"$f":"+E!E170","v":13.393721812865108},{"$f":"+E!F170","v":14.755963292044667},{"$f":"+E!G170","v":15.873792902321554},{"$f":"+E!H170","v":20.754637930480914}]
[null,{"$f":"+E!A171","v":"4. Sijoitetun pääoman tuotto-%"},null,{"$f":"+E!E171","v":13.396032315685586},{"$f":"+E!F171","v":16.116081683408868},{"$f":"+E!G171","v":19.00852805232708},{"$f":"+E!H171","v":27.021882291184035}]
[null,{"$f":"+E!A172","v":"5. Oman pääoman tuotto-%"},null,{"$f":"+E!E172","v":84.951134452364983},{"$f":"+E!F172","v":55.486312481096768},{"$f":"+E!G172","v":42.203340082244161},{"$f":"+E!H172","v":42.719247635525868}]
[]
[null,{"$f":"+E!A174","v":"Maksuvalmius"}]
[null,{"$f":"+E!A175","v":"1. Rahoitustulos / Liikevaihto"},{"$f":"+E!D175","v":26.266065144256856},{"$f":"+E!E175","v":26.475431559846239},{"$f":"+E!F175","v":27.003807202203287},{"$f":"+E!G175","v":27.538406150091667},{"$f":"+E!H175","v":27.080861943267504}]
[null,{"$f":"+E!A176","v":"2. Quick ratio"},{"$f":"+E!D176","v":1.6149603692622885},{"$f":"+E!E176","v":1.7067106594827346},{"$f":"+E!F176","v":1.8900565372572311},{"$f":"+E!G176","v":2.1509673000485776},{"$f":"+E!H176","v":2.341679712132239}]
[]
[null,{"$f":"+E!A178","v":"Vakavaraisuus"}]
[null,{"$f":"+E!A179","v":"1. Omavaraisuusaste"},{"$f":"+E!D179","v":10.887050072184204},{"$f":"+E!E179","v":20.885923295078058},{"$f":"+E!F179","v":33.432791714110834},{"$f":"+E!G179","v":48.624321539908173},{"$f":"+E!H179","v":67.650323701230619}]
[null,{"$f":"+E!A180","v":"2. Rahoitustulos / Velat (%)"},{"$f":"+E!D180","v":19.383983272184427},{"$f":"+E!E180","v":25.030640385451861},{"$f":"+E!F180","v":34.341092868372016},{"$f":"+E!G180","v":51.09211960615535},{"$f":"+E!H180","v":85.724540763599265}]
[]
[null,"Rahoitusriski: Taipumus kuulua konkurssiyritysten (1) tai toimivien yritysten (0) joukkoon"]
[null,{"$f":"+E!A183","v":"1. Kolmen muuttujan P-luku "},{"$f":"+E!D183","v":0.55562024372303342},{"$f":"+E!E183","v":0.48694397851049387},{"$f":"+E!F183","v":0.40048716786581695},{"$f":"+E!G183","v":0.3038293826107476},{"$f":"+E!H183","v":0.20657542726185887}]
[]
[]
[null,"TULKINTARAPORTTI"]
[]
[null,null,{"$f":"+C4","v":"Ennakoidut viisi vuotta:"}]
[null,null,1,2,3,4,5]
[null,"Kannattavuus"]
[null,"Käyttökate / Myyntituotot (%)",{"$f":"+IF(C84>0,\"Positiivinen\",\"Negatiivinen\")","v":"Positiivinen"},{"$f":"+IF(D84>0,\"Positiivinen\",\"Negatiivinen\")","v":"Positiivinen"},{"$f":"+IF(E84>0,\"Positiivinen\",\"Negatiivinen\")","v":"Positiivinen"},{"$f":"+IF(F84>0,\"Positiivinen\",\"Negatiivinen\")","v":"Positiivinen"},{"$f":"+IF(G84>0,\"Positiivinen\",\"Negatiivinen\")","v":"Positiivinen"}]
[null,"Sijoitetun pääoman tuotto-%",null,{"$f":"+IF(D87>15,\"Erinomainen\",IF(D87>10,\"Hyvä\",IF(D87>6,\"Tyydyttävä\",IF(D87>3,\"Välttävä\",\"Heikko\"))))","v":"Hyvä"},{"$f":"+IF(E87>15,\"Erinomainen\",IF(E87>10,\"Hyvä\",IF(E87>6,\"Tyydyttävä\",IF(E87>3,\"Välttävä\",\"Heikko\"))))","v":"Erinomainen"},{"$f":"+IF(F87>15,\"Erinomainen\",IF(F87>10,\"Hyvä\",IF(F87>6,\"Tyydyttävä\",IF(F87>3,\"Välttävä\",\"Heikko\"))))","v":"Erinomainen"},{"$f":"+IF(G87>15,\"Erinomainen\",IF(G87>10,\"Hyvä\",IF(G87>6,\"Tyydyttävä\",IF(G87>3,\"Välttävä\",\"Heikko\"))))","v":"Erinomainen"}]
[null,"Oman pääoman tuotto-%",null,{"$f":"+IF(D88=\"\",\"\",IF(D88>20,\"Erinomainen\",IF(D88>15,\"Hyvä\",IF(D88>10,\"Tyydyttävä\",IF(D88>5,\"Välttävä\",\"Heikko\")))))","v":"Erinomainen"},{"$f":"+IF(E88=\"\",\"\",IF(E88>20,\"Erinomainen\",IF(E88>15,\"Hyvä\",IF(E88>10,\"Tyydyttävä\",IF(E88>5,\"Välttävä\",\"Heikko\")))))","v":"Erinomainen"},"Erinomainen","Erinomainen"]
[]
[null,"Maksuvalmius"]
[null,"Rahoitustulos / Myyntituotot",{"$f":"+IF(C91>0,\"Positiivinen\",\"Negatiivinen\")","v":"Positiivinen"},{"$f":"+IF(D91>0,\"Positiivinen\",\"Negatiivinen\")","v":"Positiivinen"},{"$f":"+IF(E91>0,\"Positiivinen\",\"Negatiivinen\")","v":"Positiivinen"},{"$f":"+IF(F91>0,\"Positiivinen\",\"Negatiivinen\")","v":"Positiivinen"},{"$f":"+IF(G91>0,\"Positiivinen\",\"Negatiivinen\")","v":"Positiivinen"}]
[null,"Quick ratio",{"$f":"+IF(C92>1.5,\"Erinomainen\",IF(C92>1,\"Hyvä\",IF(C92>0.5,\"Tyydyttävä\",IF(C92>0.3,\"Välttävä\",\"Heikko\"))))","v":"Erinomainen"},{"$f":"+IF(D92>1.5,\"Erinomainen\",IF(D92>1,\"Hyvä\",IF(D92>0.5,\"Tyydyttävä\",IF(D92>0.3,\"Välttävä\",\"Heikko\"))))","v":"Erinomainen"},{"$f":"+IF(E92>1.5,\"Erinomainen\",IF(E92>1,\"Hyvä\",IF(E92>0.5,\"Tyydyttävä\",IF(E92>0.3,\"Välttävä\",\"Heikko\"))))","v":"Erinomainen"},{"$f":"+IF(F92>1.5,\"Erinomainen\",IF(F92>1,\"Hyvä\",IF(F92>0.5,\"Tyydyttävä\",IF(F92>0.3,\"Välttävä\",\"Heikko\"))))","v":"Erinomainen"},{"$f":"+IF(G92>1.5,\"Erinomainen\",IF(G92>1,\"Hyvä\",IF(G92>0.5,\"Tyydyttävä\",IF(G92>0.3,\"Välttävä\",\"Heikko\"))))","v":"Erinomainen"}]
[]
[null,"Vakavaraisuus"]
[null,"Omavaraisuusaste",{"$f":"+IF(C95>50,\"Erinomainen\",IF(C95>35,\"Hyvä\",IF(C95>25,\"Tyydyttävä\",IF(C95>15,\"Välttävä\",\"Heikko\"))))","v":"Heikko"},{"$f":"+IF(D95>50,\"Erinomainen\",IF(D95>35,\"Hyvä\",IF(D95>25,\"Tyydyttävä\",IF(D95>15,\"Välttävä\",\"Heikko\"))))","v":"Välttävä"},"Tyydyttävä","Hyvä","Erinomainen"]
[null,"Rahoitustulos / Velat (%)",{"$f":"+IF(1/(C96/100)<1,\"Erinomainen\",IF(1/(C96/100)<3,\"Hyvä\",IF(1/(C96/100)<5,\"Tyydyttävä\",IF(1/(C96/100)<10,\"Välttävä\",\"Heikko\"))))","v":"Välttävä"},{"$f":"+IF(1/(D96/100)<1,\"Erinomainen\",IF(1/(D96/100)<3,\"Hyvä\",IF(1/(D96/100)<5,\"Tyydyttävä\",IF(1/(D96/100)<10,\"Välttävä\",\"Heikko\"))))","v":"Tyydyttävä"},"Hyvä","Hyvä","Hyvä"]
[]
[null,"Rahoitusriski"]
[null,"Kolmen muuttujan P-luku",{"$f":"+IF(C99>0.65,\"Erittäin suuri riski\",IF(C99>0.45,\"Suuri riski\",IF(C99>0.25,\"Kohtuullinen riski\",IF(C99>0.1,\"Suhteellisen pieni riski\",\"Pieni riski\"))))","v":"Suuri riski"},{"$f":"+IF(D99>0.65,\"Erittäin suuri riski\",IF(D99>0.45,\"Suuri riski\",IF(D99>0.25,\"Kohtuullinen riski\",IF(D99>0.1,\"Suhteellisen pieni riski\",\"Pieni riski\"))))","v":"Suuri riski"},"Kohtuullinen riski","Kohtuullinen riski","Suhteellisen pieni riski"]
[]
[]
[null,"LIITEKUVIOT"]
[null,null,null,null,null,null,null,null,null,"Vuosi",1,2,3,4,5]
[null,null,null,null,null,null,null,null,null,"Käyttökate",{"$f":"+C31","v":69210},{"$f":"+D31","v":73330.5},{"$f":"+E31","v":77676.824999999997},{"$f":"+F31","v":82260.860249999998},{"$f":"+G31","v":87095.103082499991}]
[null,null,null,null,null,null,null,null,null,"Liiketulos",{"$f":"+C39","v":39676.666666666664},{"$f":"+D39","v":43797.166666666664},{"$f":"+E39","v":48643.491666666661},{"$f":"+F39","v":53227.526916666662},{"$f":"+G39","v":70561.769749166648}]
[null,null,null,null,null,null,null,null,null,"Tilikauden tulos",{"$f":"+C42","v":26941.333333333332},{"$f":"+D42","v":30237.73333333333},{"$f":"+E42","v":34978.793333333328},{"$f":"+F42","v":39510.021533333333},{"$f":"+G42","v":54241.415799333321}]
[]
[]
[]
[]
[]
[]
[]
[]
[]
[]
[]
[]
[]
[]
[]
[]
[]
[null,null,null,null,null,null,null,null,null,"Vuosi",1,2,3,4,5]
[null,null,null,null,null,null,null,null,null,"Sijoitetun pääoman tuotto-%",null,{"$f":"+D87","v":13.396032315685586},{"$f":"+E87","v":16.116081683408868},{"$f":"+F87","v":19.00852805232708},{"$f":"+G87","v":27.021882291184035}]
[null,null,null,null,null,null,null,null,null,"Quick ratio",{"$f":"+C92","v":1.6149603692622885},{"$f":"+D92","v":1.7067106594827346},{"$f":"+E92","v":1.8900565372572311},{"$f":"+F92","v":2.1509673000485776},{"$f":"+G92","v":2.341679712132239}]
[null,null,null,null,null,null,null,null,null,"Omavaraisuusaste",{"$f":"+C95","v":10.887050072184204},20.885923295078058,33.432791714110834,48.624321539908173,67.650323701230619]
[]
[]
[]
[]
[]
[]
[]
[]
[]
[]
[]
[]
[]
[]
[]
[]
[null,null,null,null,null,null,null,null,null,"Vuosi",1,2,3,4,5]
[null,null,null,null,null,null,null,null,null,"Rahoitusriski",{"$f":"+C99","v":0.55562024372303342},{"$f":"+D99","v":0.48694397851049387},0.40048716786581695,0.3038293826107476,0.20657542726185887]
[null,null,null,null,null,null,null,null,null,"Kriittinen taso",0.5,0.5,0.5,0.5,0.5]