{"text_format":"1","workbook":"xlsx","n_sheets":3,"sheets":["K","E","T"],"not_rendered":{"charts":6,"images":0,"macros":0,"external_links":0,"defined_names":0,"comments":0,"pivot_tables":0},"unopened":[],"bounds":{"document_bytes":16777216,"sheet_cells":100000,"rows_first":2000,"rows_last":500,"rows_between":2000,"halvings":0,"cell_chars":16384,"cell_head_chars":4096},"cells_cut":0,"cells_raw":0,"read":"whole","date_system":"1900"}

{"sheet":"K","index":0,"n_rows":312,"n_cols":8,"rows_kept":312,"cut":false,"hidden":false,"merged":[[108,0,108,4],[97,0,97,4],[83,0,83,3],[87,0,87,3],[88,0,88,3],[89,0,89,3],[90,0,90,3],[94,0,94,3],[78,0,78,3],[81,0,81,3],[9,0,9,6],[25,0,25,6],[11,0,11,6],[14,0,14,4],[75,0,75,3],[76,0,76,3],[77,0,77,3],[79,0,79,3],[80,0,80,3],[72,0,72,3],[73,0,73,3],[74,0,74,3],[70,0,70,3],[71,0,71,3],[110,0,110,4],[5,0,5,6],[104,0,104,4],[105,0,105,4],[106,0,106,4],[107,0,107,4],[98,0,98,4],[99,0,99,4],[102,0,102,4],[103,0,103,4],[91,0,91,3],[92,0,92,3],[93,0,93,3],[69,0,69,3],[57,0,57,4],[58,0,58,4],[55,0,55,4],[56,0,56,4],[59,0,59,4],[61,0,61,4],[64,0,64,4],[3,0,3,6],[19,0,19,4],[20,0,20,4],[21,0,21,4],[16,0,16,4],[82,0,82,3],[7,0,7,4],[13,0,13,4],[37,0,37,4],[311,0,311,5],[41,0,41,4],[42,0,42,4],[43,0,43,4],[44,0,44,4],[46,0,46,4],[47,0,47,4],[48,0,48,4],[45,0,45,4],[52,0,52,4],[53,0,53,4],[54,0,54,4]]}
[]
["TOIMIVAN RATSASTUSKOULUN TILINPÄÄTÖSTEN ENNAKOINTI VIIDELLE VUODELLE"]
[]
["Tällä laskentamallilla voit helposti laatia jo toimivalle ratsastuskoulullesi alustavan taloudellisen laskelman seuraavan viiden vuoden toiminnasta.  Ratsastuskoulun lisäksi sinulla on mahdollisuus sisällyttää laskelmiin täysihoitoon otettuja hevosia. Syötä laskentaa varten malliin ensin tiedot ratsastuskoulusi viime tilinpäätöksen liikevaihdosta, taseen omaisuudesta ja poistoista, yrityksesi veroprosentista, velkojen koroista ja lyhennyksistä, sinun voitto-osuudestasi, rahoitusomaisuuden riittävästä määrästä sekä arvioi liikevaihdon ja kiinteiden kulujen kasvuprosentit ajanjaksolle. Syötä tämän jälkeen yrityksesi seuraavalle toimintavuodelle ennakoimasi tulot ja kulut, investoinnit ja rahoitus. Tässä laskentamallissa ei oteta huomioon arvonlisäveroa."]
[]
["Taulukossa on valmiina esimerkkinä kuvitteellisen toimivan ratsastuskoulun luvut. Tässä omissa tiloissaan toimivassa ratsastuskoulussa on opetuskäytössä 10 hevosta, jonka lisäksi tallilla on 5 hevosta täysihoidossa. Ratsastuskoulu rahoittaa toimintansa tulorahoituksen lisäksi lyhytaikaisella ja pitkäaikaisella velalla ja omalla pääomalla. Muuta taulukon vihreissä ruuduissa olevat esimerkkiluvut oman yrityksesi arvioiduiksi luvuiksi. "]
[]
["Miten suuri ratsastuskoulusi liikevaihto oli viime tilinpäätöksessä (tuloslaskelmassa)?",null,null,null,null,200000,"euroa",{"$f":"+IF(F8>=0,\"\",\"Luvun pitää olla positiivinen!\")","v":""}]
[]
["Syötä viime tilinpäätöksen taseen tiedot niin, että omaisuuspuoli (vastaavaa) ja pääomapuoli (vastattavaa) ovat yhtä suuret (samat kuin taseessa). "]
[]
["Omaisuuspuoli eli vastaavaa: lyhyt- ja pitkäaikainen omaisuus"]
[null,null,null,null,null,"Taseen arvo"]
["Miten paljon viime tilinpäätöksen taseessa oli yhteensä rahoitusomaisuutta (kassa ja pankkitili) ja muuta lyhytaikaista omaisuutta? ",null,null,null,null,10000,"euroa",{"$f":"+IF(F14>=0,\"\",\"Luvun pitää olla positiivinen tai nolla!\")","v":""}]
["Laita tähän kaikki lyhytaikainen omaisuus taseesta (rahoitus-, vaihto ja muu lyhytaikainen omaisuus)."]
[]
["Miten paljon viime tilinpäätöksen taseessa oli pitkäaikaista omaisuutta alla olevan jaon mukaisesti? Miten suuret poistot tästä pitkäaikaisesta omaisuudesta tehtiin tuloslaskelmassa? Laita jäljelle jäävät erät muuhun käyttöomaisuuteen."]
[]
["Huom! Ota omaisuuden todelliset luvut suoraan viimeisestä taseesta ja poistot viimeisestä tuloslaskelmasta!",null,null,null,null,"Taseen arvo","Tehty poisto"]
["Taseen pitkäaikaiseen omaisuuteen kirjatut hevoset ja viime tuloslaskelmassa tehdyt poistot?",null,null,null,null,25000,5000,{"$f":"+IF(F20>=0,\"\",\"Luvun pitää olla positiivinen tai nolla!\")","v":""}]
["Taseen pitkäaikaiseen omaisuuteen kirjatut maa- ja vesialueet?",null,null,null,null,80000,0,""]
["Taseen pitkäaikaiseen omaisuuteen kirjatut rakennukset ja rakennelmat (esim. maneesi, talli)?",null,null,null,null,140000,10000,""]
["Taseen pitkäaikaiseen omaisuuteen kirjatut koneet ja kalusto (esim. traktori, hara, aura)?",null,null,null,null,15000,5000,""]
["Taseen pitkäaikaiseen omaisuuteen kirjattu muu käyttöomaisuus (esim. työkalut ja tarvikkeet)?",null,null,null,null,1500,300,""]
[]
["Pääomapuoli eli vastattavaa: lyhyt- ja pitkäaikaiset velat (vieras pääoma) ja oma pääoma"]
[]
["Jaa kaikki taseen pääomapuolella eli vastattavissa olevat erät lyhyt- ja pitkäaikaisiin velkoihin ja omaan pääomaan."]
["(summan pitää vastata taseesn vastattavien summaa)",null,null,null,null,"Taseen arvo"]
["Miten paljon viime tilikauden taseessa oli lyhytaikaista (alle vuoden mittaista) velkaa?",null,null,null,null,20000,"euroa",{"$f":"+IF(F30>=0,\"\",\"Luvun pitää olla positiivinen tai nolla!\")","v":""}]
["Miten paljon viime tilikauden taseessa oli pitkäaikaista (yli vuoden mittaista) velkaa?",null,null,null,null,210000,"euroa",""]
["Miten paljon viime tilikauden omassa pääomassa oli kertyneitä voittovaroja?",null,null,null,null,30000,"euroa",""]
["Miten paljon viime tilikauden omassa pääomassa oli muuta omaa pääomaa? (kaikki muut erät kuin kertyneet voittovarat)",null,null,null,null,11500,"euroa",""]
[]
["Huomaa, että olet edellä ilmoittanut viime tilikauden taseen  lyhyt- ja pitkäaikaiseksi omaisuudeksi yhteensä:",null,null,null,null,{"$f":"+F14+SUM(F20:F24)","v":271500},"euroa"]
["Huomaa, että olet edellä ilmoittanut viime tilikauden taseen pääomaksi (oma ja vieras pääoma) yhteensä:",null,null,null,null,{"$f":"+SUM(F30:F33)","v":271500},"euroa"]
[]
[{"$f":"+IF(F35=F36,\"Viime tilinpäätöksen taseen omaisuus- ja pääomapuoli ovat kuten pitääkin yhtä suuret, joten jatka tietojen syöttämistä.\",\"Viime tilinpäätöksen taseen omaisuus- ja pääomapuoli eivät ole yhtä suuria! Korjaa annettuja tietoja.\")","v":"Viime tilinpäätöksen taseen omaisuus- ja pääomapuoli ovat kuten pitääkin yhtä suuret, joten jatka tietojen syöttämistä."}]
[]
["Syötä sen jälkeen seuraavat laskennassa tarvittavat tiedot:"]
[null,null,null,null,null,"Muut tiedot","%-osuus"]
["Kuinka monta prosenttia yrityksesi maksaa veroja verotettavasta tuloksesta? (esim. osakeyhtiöillä verokanta on 20 % 2021)",null,null,null,null,20,{"$f":"+F42/100","v":0.2},{"$f":"+IF(F42>=0,\"\",\"Luvun pitää olla positiivinen tai nolla!\")","v":""}]
["Miten korkea on yrityksesi lyhytaikaisen (alle vuoden mittaisen) velan vuotuinen korkoprosentti?",null,null,null,null,3,0.03,""]
["Miten korkea on yrityksesi pitkäaikaisen (yli vuoden mittaisen) velan vuotuinen korkoprosentti?",null,null,null,null,2,0.02,""]
["Miten monta prosenttia (suunnilleen) pitkäaikaisesta velasta maksetaan vuosittain takaisin? ",null,null,null,null,15,0.15,""]
["Miten paljon aiot nostaa yrityksestä voitto-osuutta (esim. osinkoja) prosentteina yrityksen tuottamista kertyneistä voitoista?",null,null,null,null,5,0.05,""]
["Miten paljon vähintään aiot pitää varoja lyhytaikaisessa omaisuudessa toiminnan pyörittämistä varten prosentteina liikevaihdosta?",null,null,null,null,5,0.05,""]
["Miten monta prosenttia arvioit yrityksesi liikevaihdon kasvavan vuosittain seuraavien viiden vuoden aikana?",null,null,null,null,5,0.05,""]
["Miten monta prosenttia arvioit yrityksesi kiinteiden kustannusten kasvavan vuosittain seuraavien viiden vuoden aikana?",null,null,null,null,3,0.03,""]
[]
["Laadi seuraavaksi arvio ratsastuskoulun seuraavan vuoden liikevaihdosta. "]
[]
["Miten korkeaksi arvioit ratsastuskoulusi ratsastustunnin keskimääräisen hinnan?",null,null,null,null,27,"euroa",{"$f":"+IF(F53>=0,\"\",\"Luvun pitää olla positiivinen tai nolla!\")","v":""}]
["Kuinka monta hevosta sinulla on ratsastuskoulutoiminnassa?",null,null,null,null,10,"hevosta",""]
["Kuinka monta tuntia keskimäärin hevonen osallistuu ratsastustunnille viikottain? (vuodessa on 52 viikkoa)",null,null,null,null,15,"tuntia viikossa",""]
["Montako hevosta on keskimäärin yhdessä opetusryhmässä?",null,null,null,null,6,"hevosta",""]
["Miten täysiksi arvioit opetusryhmät keskimäärin prosentteina 0 - 100 % (täydet ryhmät)?",null,null,null,null,85,"%",""]
["Miten monta hevosta keskimäärin on koulun hevosten lisäksi tallissa täysihoidossa?",null,null,null,null,5,"hevosta",""]
["Miten paljon arvioit täysihoidon hinnaksi hevosta kohti kuukaudessa?",null,null,null,null,600,"euroa / kk",""]
["Esittämiesi lukujen perusteella seuraavan vuoden liikevaihto siten seuraava:",null,null,null,null,{"$f":"+(F57/100)*(F53*F54*F55*52)+12*F58*F59","v":215010},"euroa"]
[]
["Ratsastuskoulun seuraavan vuoden ennakoitu liikevaihto on:",null,null,null,null,{"$f":"+F60","v":215010},"euroa"]
["Huomaa, että antamillasi tiedoilla ratsastuskoulusi liikevaihdon ennakoitu kasvu viime tilikaudesta on:",null,null,null,null,{"$f":"100*(F62-F8)/F8","v":7.5049999999999999},"%"]
[]
["Kuinka monta ratsastustuntia tarkoituksesi on itse pitää (ilman palkanmaksua) ratsastuskoulun tunneista keskimäärin viikossa?",null,null,null,null,0,"tuntia viikossa",{"$f":"+IF(F65>=0,\"\",\"Luvun pitää olla positiivinen tai nolla!\")","v":""}]
[]
["Laadi sitten arvio yrityksen kulujen määrästä."]
[]
["Muuttuvat kulut:"]
["Millaisiksi arvioit seuraavan vuoden muuttuvat kulut, jotka riippuvat suoraan hevosten määrästä?",null,null,null,null,"Vuodessa:","Liikevaih-dosta, %"]
["Miten paljon kulut karkearehusta ovat hevosta kohti kuukaudessa (euroa / hevonen / kuukausi)?",null,null,null,100,{"$f":"+E71*(12*$F$54+12*$F$58)","v":18000},{"$f":"100*F71/$F$62","v":8.3717036416910844},{"$f":"+IF(F71>=0,\"\",\"Luvun pitää olla positiivinen tai nolla!\")","v":""}]
["Miten paljon kulut väkirehusta ovat hevosta kohti kuukaudessa (euroa / hevonen / kuukausi)?",null,null,null,20,{"$f":"+E72*(12*$F$54+12*$F$58)","v":3600},1.6743407283382168,""]
["Miten paljon kulut kivennäisistä ovat hevosta kohti kuukaudessa (euroa / hevonen / kuukausi)?",null,null,null,20,{"$f":"+E73*(12*$F$54+12*$F$58)","v":3600},1.6743407283382168,""]
["Miten paljon muut ruokintakulut ovat hevosta kohti kuukaudessa (euroa / hevonen / kuukausi)?",null,null,null,20,{"$f":"+E74*(12*$F$54+12*$F$58)","v":3600},1.6743407283382168,""]
["Miten paljon kuivikekulut ovat hevosta kohti kuukaudessa (euroa / hevonen / kuukausi)?",null,null,null,50,{"$f":"+E75*(12*$F$54+12*$F$58)","v":9000},4.1858518208455422,""]
["Miten paljon kengityskulut ovat hevosta kohti kuukaudessa (euroa / hevonen / kuukausi)?",null,null,null,50,{"$f":"+E76*12*$F$54","v":6000},2.7905678805636946,""]
["Miten paljon madotuskulut ovat hevosta kohti vuodessa (euroa / hevonen / vuosi)?",null,null,null,50,{"$f":"+E77*$F$54","v":500},0.2325473233803079,""]
["Miten paljon rokotuskulut ovat hevosta kohti vuodessa (euroa / hevonen / vuosi)?",null,null,null,100,{"$f":"+E78*$F$54","v":1000},0.46509464676061579,""]
["Miten paljon raspauskulut ovat hevosta kohti vuodessa (euroa / hevonen / vuosi)?",null,null,null,100,{"$f":"+E79*$F$54","v":1000},0.46509464676061579,""]
["Miten paljon eläinlääkärikulut ovat hevosta kohti vuodessa (euroa / hevonen / vuosi)?",null,null,null,200,{"$f":"+E80*$F$54","v":2000},0.93018929352123159,""]
["Miten paljon varustekulut (esim. satulat, suitset) ovat hevosta kohti vuodessa (euroa / hevonen / vuosi)?",null,null,null,500,{"$f":"+E81*$F$54","v":5000},2.3254732338030788,""]
["Miten paljon ratsastuksen opettajien palkat lisineen ovat opetustuntia kohti (tuntipalkka, euroa / tunti)?",null,null,null,35,{"$f":"+E82*((F54*F55*52)/F56-F65*52)","v":45500},21.161806427608017,""]
["Miten paljon täysihoidon muuttuvat palkat lisineen (esim. hoitaja) ovat täysihoidossa olevaa hevosta kohti kuukaudessa? (euroa / hevonen / kuukausi)",null,null,null,200,{"$f":"12*$F$58*E83","v":12000},5.5811357611273893,""]
["Miten paljon muut muuttuvat kulut (esim. tarvikkeet, vakuutukset) ovat hevosta kohti vuodessa  (euroa / hevonen / vuosi)?",null,null,null,200,{"$f":"+E84*$F$54","v":2000},0.93018929352123159,""]
["Seuraavan vuoden ennakoitu myyntikate (liikevaihto - muuttuvat kulut) on:",null,null,null,null,{"$f":"+F62-SUM(F71:F84)","v":102210},47.53732384540254]
[]
["Kiinteät kulut:",null,null,{"$f":"+IF(B87<0,\" Huom! Luvun pitää olla positiivinen tai nolla!\",\"\")","v":""}]
["Millaisiksi arvioit seuraavan vuoden kiinteät kulut?",null,null,null,null,null,"Liikevaih-dosta, %"]
["Kuinka paljon arvioit vuokrakuluiksi kuukaudessa käyttämistäsi tiloista? (euroa / kuukausi) (jos vuokratiloja)",null,null,null,0,{"$f":"12*E89","v":0},{"$f":"100*F89/$F$62","v":0},{"$f":"+IF(F89>=0,\"\",\"Luvun pitää olla positiivinen tai nolla!\")","v":""}]
["Kuinka paljon arvioit sähkön kulutuksen kuluiksi kuukaudessa? (euroa / kuukausi) ",null,null,null,200,{"$f":"12*E90","v":2400},1.1162271522254779,""]
["Kuinka paljon arvioit veden kulutuksen kuluiksi kuukaudessa? (euroa / kuukausi) ",null,null,null,100,1200,0.55811357611273893,""]
["Kuinka paljon arvioit pohjien huollon kuluiksi kuukaudessa (maneesi ja ratsastuskenttä)? (euroa / kuukausi) ",null,null,null,250,3000,1.3952839402818473,""]
["Kuinka paljon arvioit lantalan tyhjennyksen kuluiksi kuukaudessa? (euroa / kuukausi) ",null,null,null,100,1200,0.55811357611273893,""]
["Kuinka suuriksi arvioit kiinteät palkkakustannukset lisineen (esim. tallityöntekijät, kirjanpitäjä) kuukaudessa? (euroa / kuukausi)",null,null,null,2000,24000,11.162271522254779,""]
["Kuinka suuriksi arvioit muut edellä mainitsemattomat kiinteät kulut kuukaudessa? (euroa / kuukausi)",null,null,null,100,1200,0.55811357611273893,""]
["Seuraavan vuoden ennakoitu käyttökate (liikevaihto - muuttuvat kulut - kiinteät kulut) on:",null,null,null,null,{"$f":"+F85-SUM(F89:F95)","v":69210},32.189200502302221]
[]
["Esittämiesi lukujen perusteella arvioit ensimmäisen vuoden kuluiksi yhteensä:",null,null,null,null,{"$f":"+SUM(F71:F84)+SUM(F89:F95)","v":145800},67.810799497697786]
[{"$f":"+IF(F99>0,\"Esittämiesi lukujen perusteella liikevaihdon ja muuttuvien kulujen erotus (myyntikate) on:\",\"Muuta antamiasi tietoja, sillä liikevaihdon ja muuttuvien kulujen erotus on negatiivinen:\")","v":"Esittämiesi lukujen perusteella liikevaihdon ja muuttuvien kulujen erotus (myyntikate) on:"},null,null,null,null,{"$f":"+F85","v":102210},47.53732384540254]
[{"$f":"+IF(F100>0,\"Esittämiesi lukujen perusteella liikevaihdon ja  kaikkien kulujen erotus (käyttökate) on:\",\"Muuta antamiasi tietoja, sillä liikevaihdon ja kulujen erotus on negatiivinen:\")","v":"Esittämiesi lukujen perusteella liikevaihdon ja  kaikkien kulujen erotus (käyttökate) on:"},null,null,null,null,{"$f":"+F96","v":69210},32.189200502302221]
[]
["Mahdolliset uudet (seuraavan vuoden)  investoinnit (pitkäaikaiset sijoitukset) ratsastuskouluun:"]
["Miten paljon aiot investoida euroissa ratsastuskouluun seuraavana vuonna?",null,null,null,null,null,"Liikevaih-dosta, %"]
["Miten paljon aiot sijoittaa euroja uusien hevosten hankkimiseen ratsastuskoulun toimintaa varten?",null,null,null,null,5000,{"$f":"100*F104/$F$62","v":2.3254732338030788},{"$f":"+IF(F104>=0,\"\",\"Luvun pitää olla positiivinen tai nolla!\")","v":""}]
["Miten paljon aiot sijoittaa euroja maa- ja vesialueisiin? (esim. tontin ostamiseen)",null,null,null,null,0,0,""]
["Miten paljon aiot sijoittaa euroja rakennuksiin ja rakennelmiin? (esim. talli ja maneesi)",null,null,null,null,5000,2.3254732338030788,""]
["Miten paljon aiot sijoittaa euroja koneisiin ja kalustoon (esim. traktori, hara, aura)?",null,null,null,null,10000,4.6509464676061576,""]
["Miten paljon aiot sijoittaa euroja muuhun käyttöomaisuuteen (esim. työkalut, irtaimisto)?",null,null,null,null,500,0.2325473233803079,""]
["Esittämiesi lukujen perusteella sijoitat euroja yrityksesi uuteen omaisuuteen yhteensä:",null,null,null,null,{"$f":"+SUM(F104:F108)","v":20500},9.5344402585926229]
[]
["Ratsastuskoulun uusien investointien rahoitus:"]
["Millä tavalla aiot rahoittaa ratsastuskoulun seuraavan toimintavuoden investoinnit?",null,null,null,null,null,"Liikevaih-dosta, %"]
["Miten paljon aiot ottaa lisää lyhytaikaista velkaa toimintaa varten? (euroja)",null,null,{"$f":"+IF(C113<0,\" Huom! Luvun pitää olla positiivinen tai nolla!\",\"\")","v":""},null,500,{"$f":"100*F113/$F$62","v":0.2325473233803079},{"$f":"+IF(F113>=0,\"\",\"Luvun pitää olla positiivinen tai nolla!\")","v":""}]
["Miten paljon aiot ottaa lisää pitkäaikaista velkaa investointien rahoittamista varten? (euroja)",null,null,{"$f":"+IF(C114<0,\" Huom! Luvun pitää olla positiivinen tai nolla!\",\"\")","v":""},null,15000,6.9764197014092364,""]
["Miten paljon aiot sijoittaa toimintaan lisää omaa pääomaa? (euroja)",null,null,null,null,5000,2.3254732338030788,""]
["Esittämiesi lukujen perusteella otat seuraavana vuonna velkaa ja sijoitat omaa pääomaa yritykseesi yhteensä:",null,null,null,null,{"$f":"+SUM(F113:F115)","v":20500},9.5344402585926229]
[]
["Sijoittamasi oman pääoman osuus uudesta pääomarahoituksesta on:",null,null,null,null,{"$f":"100*F115/F116","v":24.390243902439025},"%"]
["Sijoitetun uuden oman pääoman ja otetun uuden pitkäaikaisen velan osuus uusien investointien rahoituksesta on:",null,null,null,null,{"$f":"100*(F114+F115)/F109","v":97.560975609756099},"%"]
[]
[]
["MALLIN TUOTTAMAT TILINPÄÄTÖSLASKELMAT VIIDELLE VUODELLE"]
[]
[{"$f":"+T!B3","v":"ENNAKOITU TULOSLASKELMA"}]
[null,{"$f":"+T!C4","v":"Ennakoidut viisi vuotta:"}]
[null,{"$f":"+T!C5","v":1},{"$f":"+T!D5","v":2},{"$f":"+T!E5","v":3},{"$f":"+T!F5","v":4},{"$f":"+T!G5","v":5}]
[{"$f":"+T!B6","v":"Liikevaihto"},{"$f":"+T!C6","v":215010},{"$f":"+T!D6","v":225760.5},{"$f":"+T!E6","v":237048.52499999999},{"$f":"+T!F6","v":248900.95125000001},{"$f":"+T!G6","v":261345.99881250001}]
[{"$f":"+T!B7","v":" - Muuttuvat kulut"}]
[{"$f":"+T!B8","v":"Karkearehu"},{"$f":"+T!C8","v":18000},{"$f":"+T!D8","v":18900},{"$f":"+T!E8","v":19845},{"$f":"+T!F8","v":20837.250000000004},{"$f":"+T!G8","v":21879.112500000003}]
[{"$f":"+T!B9","v":"Väkirehu"},{"$f":"+T!C9","v":3599.9999999999995},{"$f":"+T!D9","v":3779.9999999999995},{"$f":"+T!E9","v":3968.9999999999995},{"$f":"+T!F9","v":4167.45},{"$f":"+T!G9","v":4375.8224999999993}]
[{"$f":"+T!B10","v":"Kivennäiset"},{"$f":"+T!C10","v":3599.9999999999995},{"$f":"+T!D10","v":3779.9999999999995},{"$f":"+T!E10","v":3968.9999999999995},{"$f":"+T!F10","v":4167.45},{"$f":"+T!G10","v":4375.8224999999993}]
[{"$f":"+T!B11","v":"Muut ruokintakustannukset"},{"$f":"+T!C11","v":3599.9999999999995},{"$f":"+T!D11","v":3779.9999999999995},{"$f":"+T!E11","v":3968.9999999999995},{"$f":"+T!F11","v":4167.45},{"$f":"+T!G11","v":4375.8224999999993}]
[{"$f":"+T!B12","v":"Kuivikekustannukset"},{"$f":"+T!C12","v":9000},{"$f":"+T!D12","v":9450},{"$f":"+T!E12","v":9922.5},{"$f":"+T!F12","v":10418.625000000002},{"$f":"+T!G12","v":10939.556250000001}]
[{"$f":"+T!B13","v":"Kengitykset"},{"$f":"+T!C13","v":6000},{"$f":"+T!D13","v":6300},{"$f":"+T!E13","v":6614.9999999999991},{"$f":"+T!F13","v":6945.75},{"$f":"+T!G13","v":7293.0374999999995}]
[{"$f":"+T!B14","v":"Madotukset"},{"$f":"+T!C14","v":500.00000000000006},{"$f":"+T!D14","v":525},{"$f":"+T!E14","v":551.25},{"$f":"+T!F14","v":578.81250000000011},{"$f":"+T!G14","v":607.75312500000007}]
[{"$f":"+T!B15","v":"Rokotukset"},{"$f":"+T!C15","v":1000.0000000000001},{"$f":"+T!D15","v":1050},{"$f":"+T!E15","v":1102.5},{"$f":"+T!F15","v":1157.6250000000002},{"$f":"+T!G15","v":1215.5062500000001}]
[{"$f":"+T!B16","v":"Raspaukset"},{"$f":"+T!C16","v":1000.0000000000001},{"$f":"+T!D16","v":1050},{"$f":"+T!E16","v":1102.5},{"$f":"+T!F16","v":1157.6250000000002},{"$f":"+T!G16","v":1215.5062500000001}]
[{"$f":"+T!B17","v":"Muut eläinlääkärikulut"},{"$f":"+T!C17","v":2000.0000000000002},{"$f":"+T!D17","v":2100},{"$f":"+T!E17","v":2205},{"$f":"+T!F17","v":2315.2500000000005},{"$f":"+T!G17","v":2431.0125000000003}]
[{"$f":"+T!B18","v":"Varustekustannukset"},{"$f":"+T!C18","v":5000},{"$f":"+T!D18","v":5250},{"$f":"+T!E18","v":5512.4999999999991},{"$f":"+T!F18","v":5788.125},{"$f":"+T!G18","v":6077.53125}]
[{"$f":"+T!B19","v":"Ratsastuksen opettajien palkat lisineen"},{"$f":"+T!C19","v":45500},{"$f":"+T!D19","v":47775},{"$f":"+T!E19","v":50163.75},{"$f":"+T!F19","v":52671.9375},{"$f":"+T!G19","v":55305.534375000003}]
[{"$f":"+T!B20","v":"Täyshoitohevosten hoitajien palkat lisineen"},{"$f":"+T!C20","v":12000},{"$f":"+T!D20","v":12600},{"$f":"+T!E20","v":13229.999999999998},{"$f":"+T!F20","v":13891.5},{"$f":"+T!G20","v":14586.074999999999}]
[{"$f":"+T!B21","v":"Muut muuttuvat kulut"},{"$f":"+T!C21","v":2000.0000000000002},{"$f":"+T!D21","v":2100},{"$f":"+T!E21","v":2205},{"$f":"+T!F21","v":2315.2500000000005},{"$f":"+T!G21","v":2431.0125000000003}]
[{"$f":"+T!B22","v":" = Myyntikate"},{"$f":"+T!C22","v":102210},{"$f":"+T!D22","v":107320.5},{"$f":"+T!E22","v":112686.52499999999},{"$f":"+T!F22","v":118320.85125000001},{"$f":"+T!G22","v":124236.8938125}]
[{"$f":"+T!B23","v":" - Kiinteät kulut"}]
[{"$f":"+T!B24","v":"Vuokrakulut"},{"$f":"+T!C24","v":0},{"$f":"+T!D24","v":0},{"$f":"+T!E24","v":0},{"$f":"+T!F24","v":0},{"$f":"+T!G24","v":0}]
[{"$f":"+T!B25","v":"Sähkökulut"},{"$f":"+T!C25","v":2400},{"$f":"+T!D25","v":2472},{"$f":"+T!E25","v":2546.16},{"$f":"+T!F25","v":2622.5448000000001},{"$f":"+T!G25","v":2701.2211439999996}]
[{"$f":"+T!B26","v":"Vesikulut"},{"$f":"+T!C26","v":1200},{"$f":"+T!D26","v":1236},{"$f":"+T!E26","v":1273.08},{"$f":"+T!F26","v":1311.2724000000001},{"$f":"+T!G26","v":1350.6105719999998}]
[{"$f":"+T!B27","v":"Pohjien huolto"},{"$f":"+T!C27","v":3000},{"$f":"+T!D27","v":3090},{"$f":"+T!E27","v":3182.7},{"$f":"+T!F27","v":3278.181},{"$f":"+T!G27","v":3376.5264299999999}]
[{"$f":"+T!B28","v":"Lantalan tyhjennys"},{"$f":"+T!C28","v":1200},{"$f":"+T!D28","v":1236},{"$f":"+T!E28","v":1273.08},{"$f":"+T!F28","v":1311.2724000000001},{"$f":"+T!G28","v":1350.6105719999998}]
[{"$f":"+T!B29","v":"Kiinteät palkkakustannukset lisineen"},{"$f":"+T!C29","v":24000},{"$f":"+T!D29","v":24720},{"$f":"+T!E29","v":25461.599999999999},{"$f":"+T!F29","v":26225.448},{"$f":"+T!G29","v":27012.211439999999}]
[{"$f":"+T!B31","v":" = Käyttökate"},{"$f":"+T!C31","v":69210},{"$f":"+T!D31","v":73330.5},{"$f":"+T!E31","v":77676.824999999997},{"$f":"+T!F31","v":82260.860249999998},{"$f":"+T!G31","v":87095.103082499991}]
[{"$f":"+T!B32","v":" - Poistot"}]
[{"$f":"+T!B33","v":"Hevosten hankinta"},{"$f":"+T!C33","v":5000},{"$f":"+T!D33","v":4166.6666666666642},{"$f":"+T!E33","v":3472.2222222222226},{"$f":"+T!F33","v":2893.5185185185182},{"$f":"+T!G33","v":2411.2654320987658}]
[{"$f":"+T!B34","v":"Maa- ja vesialueet"},{"$f":"+T!C34","v":0},{"$f":"+T!D34","v":0},{"$f":"+T!E34","v":0},{"$f":"+T!F34","v":0},{"$f":"+T!G34","v":0}]
[{"$f":"+T!B35","v":"Rakennukset ja rakennelmat"},{"$f":"+T!C35","v":9666.666666666657},{"$f":"+T!D35","v":9022.222222222219},{"$f":"+T!E35","v":8420.7407407407445},{"$f":"+T!F35","v":7859.3580246913625},{"$f":"+T!G35","v":7335.40082304526}]
[{"$f":"+T!B36","v":"Koneet ja kalusto"},{"$f":"+T!C36","v":6250},{"$f":"+T!D36","v":4687.5},{"$f":"+T!E36","v":3515.625},{"$f":"+T!F36","v":2636.71875},{"$f":"+T!G36","v":1977.5390625}]
[{"$f":"+T!B38","v":"Muu käyttöomaisuus"},{"$f":"+T!C38","v":333.33333333333326},{"$f":"+T!D38","v":277.77777777777783},{"$f":"+T!E38","v":231.48148148148152},{"$f":"+T!F38","v":192.90123456790116},{"$f":"+T!G38","v":160.75102880658437}]
[{"$f":"+T!B39","v":" = Liiketulos"},{"$f":"+T!C39","v":47960.000000000015},{"$f":"+T!D39","v":55176.333333333343},{"$f":"+T!E39","v":62036.755555555545},{"$f":"+T!F39","v":68678.363722222217},{"$f":"+T!G39","v":75210.146736049384}]
[{"$f":"+T!B40","v":" - Korkokulut"},{"$f":"+T!C40","v":5115},{"$f":"+T!D40","v":4785},{"$f":"+T!E40","v":4159.5},{"$f":"+T!F40","v":3627.8250000000003},{"$f":"+T!G40","v":3175.9012499999999}]
[{"$f":"+T!B41","v":" - Verot"},{"$f":"+T!C41","v":8569.0000000000036},{"$f":"+T!D41","v":10078.26666666667},{"$f":"+T!E41","v":11575.45111111111},{"$f":"+T!F41","v":13010.107744444445},{"$f":"+T!G41","v":14406.849097209879}]
[{"$f":"+T!B42","v":"Tilikauden tulos"},{"$f":"+T!C42","v":34276.000000000015},{"$f":"+T!D42","v":40313.066666666673},{"$f":"+T!E42","v":46301.804444444439},{"$f":"+T!F42","v":52040.430977777767},{"$f":"+T!G42","v":57627.396388839508}]
[]
[{"$f":"+T!B44","v":"ENNAKOITU TASE"}]
[null,{"$f":"+T!C45","v":"Ennakoidut viisi vuotta:"}]
[null,{"$f":"+T!C46","v":1},{"$f":"+T!D46","v":2},{"$f":"+T!E46","v":3},{"$f":"+T!F46","v":4},{"$f":"+T!G46","v":5}]
[{"$f":"+T!B47","v":"Taseen omaisuus"}]
[{"$f":"+T!B48","v":"Lyhytaikainen:"}]
[{"$f":"+T!B49","v":"Rahoitusomaisuus ja muu lyhytaikainen omaisuus"},{"$f":"+T!C49","v":34026},{"$f":"+T!D49","v":58004.433333333327},{"$f":"+T!E49","v":88293.793888888889},{"$f":"+T!F49","v":124190.11850555555},{"$f":"+T!G49","v":165119.79569751234}]
[{"$f":"+T!B50","v":"Pitkäaikainen:"}]
[{"$f":"+T!B51","v":"Hevosten hankinta"},{"$f":"+T!C51","v":25000},{"$f":"+T!D51","v":20833.333333333336},{"$f":"+T!E51","v":17361.111111111113},{"$f":"+T!F51","v":14467.592592592595},{"$f":"+T!G51","v":12056.327160493829}]
[{"$f":"+T!B52","v":"Maa- ja vesialueet"},{"$f":"+T!C52","v":80000},{"$f":"+T!D52","v":80000},{"$f":"+T!E52","v":80000},{"$f":"+T!F52","v":80000},{"$f":"+T!G52","v":80000}]
[{"$f":"+T!B53","v":"Rakennukset ja rakennelmat"},{"$f":"+T!C53","v":135333.33333333334},{"$f":"+T!D53","v":126311.11111111112},{"$f":"+T!E53","v":117890.37037037038},{"$f":"+T!F53","v":110031.01234567902},{"$f":"+T!G53","v":102695.61152263376}]
[{"$f":"+T!B54","v":"Koneet ja kalusto"},{"$f":"+T!C54","v":18750},{"$f":"+T!D54","v":14062.5},{"$f":"+T!E54","v":10546.875},{"$f":"+T!F54","v":7910.15625},{"$f":"+T!G54","v":5932.6171875}]
[{"$f":"+T!B56","v":"Muu käyttöomaisuus"},{"$f":"+T!C56","v":1666.6666666666667},{"$f":"+T!D56","v":1388.8888888888889},{"$f":"+T!E56","v":1157.4074074074074},{"$f":"+T!F56","v":964.50617283950623},{"$f":"+T!G56","v":803.75514403292186}]
[{"$f":"+T!B57","v":"Yhteensä"},{"$f":"+T!C57","v":294776},{"$f":"+T!D57","v":300600.26666666666},{"$f":"+T!E57","v":315249.55777777778},{"$f":"+T!F57","v":337563.38586666668},{"$f":"+T!G57","v":366608.10671217286}]
[]
[{"$f":"+T!B59","v":"Taseen pääoma"}]
[{"$f":"+T!B60","v":"Lyhytaikainen:"}]
[{"$f":"+T!B61","v":"Lyhytaikaiset velat (maks. voitto-osuus)"},{"$f":"+T!C61","v":3213.8000000000011},{"$f":"+T!D61","v":5068.7633333333351},{"$f":"+T!E61","v":7130.4153888888895},{"$f":"+T!F61","v":9375.916168333335},{"$f":"+T!G61","v":11788.490179358645}]
[{"$f":"+T!B62","v":"Muu lyhytaikainen vieras pääoma"},{"$f":"+T!C62","v":20500},{"$f":"+T!D62","v":20500},{"$f":"+T!E62","v":20500},{"$f":"+T!F62","v":20500},{"$f":"+T!G62","v":20500}]
[{"$f":"+T!B63","v":"Pitkäaikainen:"}]
[{"$f":"+T!B64","v":"Pitkäaikainen vieras pääoma"},{"$f":"+T!C64","v":208500},{"$f":"+T!D64","v":177225},{"$f":"+T!E64","v":150641.25},{"$f":"+T!F64","v":128045.0625},{"$f":"+T!G64","v":108838.30312500001}]
[{"$f":"+T!B65","v":"Sijoitettu oma pääoma"},{"$f":"+T!C65","v":16500},{"$f":"+T!D65","v":16500},{"$f":"+T!E65","v":16500},{"$f":"+T!F65","v":16500},{"$f":"+T!G65","v":16500}]
[{"$f":"+T!B66","v":"Kertyneet voittovarat ja muu oma pääoma"},{"$f":"+T!C66","v":61062.200000000012},{"$f":"+T!D66","v":96306.503333333356},{"$f":"+T!E66","v":135477.8923888889},{"$f":"+T!F66","v":178142.40719833336},{"$f":"+T!G66","v":223981.31340781425}]
[{"$f":"+T!B67","v":"Yhteensä"},{"$f":"+T!C67","v":309776},{"$f":"+T!D67","v":315600.26666666672},{"$f":"+T!E67","v":330249.55777777778},{"$f":"+T!F67","v":352563.38586666668},{"$f":"+T!G67","v":381608.10671217291}]
[]
[{"$f":"+T!B69","v":"ENNAKOIDUT TUNNUSLUVUT"}]
[null,{"$f":"+T!C70","v":"Ennakoidut viisi vuotta:"}]
[null,{"$f":"+T!C71","v":1},{"$f":"+T!D71","v":2},{"$f":"+T!E71","v":3},{"$f":"+T!F71","v":4},{"$f":"+T!G71","v":5}]
[{"$f":"+T!B72","v":"Koko"}]
[{"$f":"+T!B73","v":"1. Liikevaihto (Euro)"},{"$f":"+T!C73","v":215010},{"$f":"+T!D73","v":225760.5},{"$f":"+T!E73","v":237048.52499999999},{"$f":"+T!F73","v":248900.95125000001},{"$f":"+T!G73","v":261345.99881250001}]
[{"$f":"+T!B74","v":"2. Taseen loppusumma (Euro)"},{"$f":"+T!C74","v":294776},{"$f":"+T!D74","v":300600.26666666666},{"$f":"+T!E74","v":315249.55777777778},{"$f":"+T!F74","v":337563.38586666668},{"$f":"+T!G74","v":366608.10671217286}]
[{"$f":"+T!B75","v":"3. Tilikauden tulos (Euro)"},{"$f":"+T!C75","v":34276.000000000015},{"$f":"+T!D75","v":40313.066666666673},{"$f":"+T!E75","v":46301.804444444439},{"$f":"+T!F75","v":52040.430977777767},{"$f":"+T!G75","v":57627.396388839508}]
[{"$f":"+T!B76","v":"4. Voitto-osuus omistajalle (Euro)"},{"$f":"+T!C76","v":3213.8000000000011},{"$f":"+T!D76","v":5068.7633333333351},{"$f":"+T!E76","v":7130.4153888888895},{"$f":"+T!F76","v":9375.916168333335},{"$f":"+T!G76","v":11788.490179358645}]
[]
[{"$f":"+T!B78","v":"Kasvu"}]
[{"$f":"+T!B79","v":"1. Liikevaihdon kasvu-%"},null,{"$f":"+T!D79","v":5},{"$f":"+T!E79","v":5},{"$f":"+T!F79","v":5},{"$f":"+T!G79","v":5}]
[{"$f":"+T!B80","v":"2. Taseen loppusumman kasvu-%"},null,{"$f":"+T!D80","v":1.9758279733311639},{"$f":"+T!E80","v":4.8733460131476107},{"$f":"+T!F80","v":7.0781473084945929},{"$f":"+T!G80","v":8.6042272537752353}]
[{"$f":"+T!B81","v":"3. Tilikauden tuloksen kasvu-%"},null,{"$f":"+T!D81","v":17.613101489866551},{"$f":"+T!E81","v":14.855574812247227},{"$f":"+T!F81","v":12.393958728366314},{"$f":"+T!G81","v":10.735816952491192}]
[]
[{"$f":"+T!B83","v":"Kannattavuus"}]
[{"$f":"+T!B84","v":"1. Käyttökate / Liikevaihto (%)"},{"$f":"+T!C84","v":32.189200502302221},{"$f":"+T!D84","v":32.481545708837466},{"$f":"+T!E84","v":32.76832243524823},{"$f":"+T!F84","v":33.049636747822589},{"$f":"+T!G84","v":33.3255926925384}]
[{"$f":"+T!B85","v":"2. Liiketulos / Liikevaihto (%)"},{"$f":"+T!C85","v":22.305939258639143},{"$f":"+T!D85","v":24.44020691544063},{"$f":"+T!E85","v":26.170487901392992},{"$f":"+T!F85","v":27.592648150725864},{"$f":"+T!G85","v":28.777998162507981}]
[{"$f":"+T!B86","v":"3. Tilikauden tulos / Liikevaihto (%)"},{"$f":"+T!C86","v":15.941584112366874},{"$f":"+T!D86","v":17.856563334448087},{"$f":"+T!E86","v":19.532627104279364},{"$f":"+T!F86","v":20.908088424904225},{"$f":"+T!G86","v":22.050230977587567}]
[{"$f":"+T!B87","v":"4. Sijoitetun pääoman tuotto-%"},null,{"$f":"+T!D87","v":18.718054839380866},{"$f":"+T!E87","v":20.637624924114796},{"$f":"+T!F87","v":21.785395737377751},{"$f":"+T!G87","v":22.280303458549991}]
[{"$f":"+T!B88","v":"5. Oman pääoman tuotto-%"},null,{"$f":"+T!D88","v":51.975145968869718},{"$f":"+T!E88","v":41.045332561746598},{"$f":"+T!F88","v":34.242105979871084},{"$f":"+T!G88","v":29.606804199723722}]
[]
[{"$f":"+T!B90","v":"Maksuvalmius"}]
[{"$f":"+T!B91","v":"1. Rahoitustulos / Liikevaihto"},{"$f":"+T!C91","v":25.824845356029954},{"$f":"+T!D91","v":25.897902127844922},{"$f":"+T!E91","v":26.130461638134594},{"$f":"+T!F91","v":26.365077022000953},{"$f":"+T!G91","v":26.597825507617983}]
[{"$f":"+T!B92","v":"2. Quick ratio"},{"$f":"+T!C92","v":1.4348607140146241},{"$f":"+T!D92","v":2.268566241438609},{"$f":"+T!E92","v":3.1955290083838102},{"$f":"+T!F92","v":4.1568639370192626},{"$f":"+T!G92","v":5.1138902680271485}]
[]
[{"$f":"+T!B94","v":"Vakavaraisuus"}]
[{"$f":"+T!B95","v":"1. Omavaraisuusaste"},{"$f":"+T!C95","v":25.038156603481227},{"$f":"+T!D95","v":35.743475290684167},{"$f":"+T!E95","v":46.019105494504117},{"$f":"+T!F95","v":55.207776814335375},{"$f":"+T!G95","v":63.01787335697162}]
[{"$f":"+T!B96","v":"2. Rahoitustulos / Velat (%)"},{"$f":"+T!C96","v":23.911584927338513},{"$f":"+T!D96","v":28.830883342911484},{"$f":"+T!E96","v":34.745776202722084},{"$f":"+T!F96","v":41.554281172090029},{"$f":"+T!G96","v":49.255248495144009}]
[]
[{"$f":"+T!B98","v":"Rahoitusriski: Taipumus kuulua konkurssiyritysten (1) tai toimivien yritysten (0) joukkoon"}]
[{"$f":"+T!B99","v":"1. Kolmen muuttujan P-luku "},{"$f":"+T!C99","v":0.46325679358003691},{"$f":"+T!D99","v":0.38472821725788009},{"$f":"+T!E99","v":0.31314731630883941},{"$f":"+T!F99","v":0.25476112982336069},{"$f":"+T!G99","v":0.21016974257354773}]
[]
[]
[{"$f":"+T!B102","v":"TULKINTARAPORTTI"}]
[]
[null,{"$f":"+T!C104","v":"Ennakoidut viisi vuotta:"}]
[null,{"$f":"+T!C105","v":1},{"$f":"+T!D105","v":2},{"$f":"+T!E105","v":3},{"$f":"+T!F105","v":4},{"$f":"+T!G105","v":5}]
[{"$f":"+T!B106","v":"Kannattavuus"}]
[{"$f":"+T!B107","v":"Käyttökate / Myyntituotot (%)"},{"$f":"+T!C107","v":"Positiivinen"},{"$f":"+T!D107","v":"Positiivinen"},{"$f":"+T!E107","v":"Positiivinen"},{"$f":"+T!F107","v":"Positiivinen"},{"$f":"+T!G107","v":"Positiivinen"}]
[{"$f":"+T!B108","v":"Sijoitetun pääoman tuotto-%"},null,{"$f":"+T!D108","v":"Erinomainen"},{"$f":"+T!E108","v":"Erinomainen"},{"$f":"+T!F108","v":"Erinomainen"},{"$f":"+T!G108","v":"Erinomainen"}]
[{"$f":"+T!B109","v":"Oman pääoman tuotto-%"},null,{"$f":"+T!D109","v":"Erinomainen"},{"$f":"+T!E109","v":"Erinomainen"},{"$f":"+T!F109","v":"Erinomainen"},{"$f":"+T!G109","v":"Erinomainen"}]
[]
[{"$f":"+T!B111","v":"Maksuvalmius"}]
[{"$f":"+T!B112","v":"Rahoitustulos / Myyntituotot"},{"$f":"+T!C112","v":"Positiivinen"},{"$f":"+T!D112","v":"Positiivinen"},{"$f":"+T!E112","v":"Positiivinen"},{"$f":"+T!F112","v":"Positiivinen"},{"$f":"+T!G112","v":"Positiivinen"}]
[{"$f":"+T!B113","v":"Quick ratio"},{"$f":"+T!C113","v":"Hyvä"},{"$f":"+T!D113","v":"Erinomainen"},{"$f":"+T!E113","v":"Erinomainen"},{"$f":"+T!F113","v":"Erinomainen"},{"$f":"+T!G113","v":"Erinomainen"}]
[]
[{"$f":"+T!B115","v":"Vakavaraisuus"}]
[{"$f":"+T!B116","v":"Omavaraisuusaste"},{"$f":"+T!C116","v":"Tyydyttävä"},{"$f":"+T!D116","v":"Hyvä"},{"$f":"+T!E116","v":"Hyvä"},{"$f":"+T!F116","v":"Erinomainen"},{"$f":"+T!G116","v":"Erinomainen"}]
[{"$f":"+T!B117","v":"Rahoitustulos / Velat (%)"},{"$f":"+T!C117","v":"Tyydyttävä"},{"$f":"+T!D117","v":"Tyydyttävä"},{"$f":"+T!E117","v":"Hyvä"},{"$f":"+T!F117","v":"Hyvä"},{"$f":"+T!G117","v":"Hyvä"}]
[]
[{"$f":"+T!B119","v":"Rahoitusriski"}]
[{"$f":"+T!B120","v":"Kolmen muuttujan P-luku"},{"$f":"+T!C120","v":"Suuri riski"},{"$f":"+T!D120","v":"Kohtuullinen riski"},{"$f":"+T!E120","v":"Kohtuullinen riski"},{"$f":"+T!F120","v":"Kohtuullinen riski"},{"$f":"+T!G120","v":"Suhteellisen pieni riski"}]
[]
[{"$f":"+T!B123","v":"LIITEKUVIOT"}]
[]
[]
[]
[]
[]
[]
[]
[]
[]
[]
[]
[]
[]
[]
[]
[]
[]
[]
[]
[]
[]
[]
[]
[]
[]
[]
[]
[]
[]
[]
[]
[]
[]
[]
[]
[]
[]
[]
[]
[]
[]
[]
[]
[]
[]
[]
[]
[]
[]
[]
[]
[]
[]
[]
[]
[]
[]
[]
[]
[]
[]
[]
[]
[]
[]
[]
[]
[]
[]
[]
[]
["Tämä raportti on suuntaa-antava laskelma siitä, miten ratsastuskoulusi voisi antamillasi lähtötiedoilla menestyä viiden seuraavan vuoden aikana. Tehdyt laskelmat perustuvat omiin arvioihisi esimerkiksi yrityksesi kasvusta ja velkojen korkokannoista. Laskelmissa ei ole huomioitu erikseen arvonlisäveroa. Vastuu laskelmien hyödyntämisestä on ohjelman käyttäjällä. Copyright Vaasan Yritysinformaatio Oy."]

{"sheet":"E","index":1,"n_rows":180,"n_cols":8,"rows_kept":180,"cut":false,"hidden":true,"merged":[]}
[1,{"$f":"+A1+1","v":2},{"$f":"+B1+1","v":3},4,5,6,7,8]
[" Copyright Vaasan Yritysinformaatio Oy. Kaikki tekijänoikeudet pidätetään."]
["TOIMIVAN RATSASTUSKOULUN TILINPÄÄTÖSENNUSTE VIIDELLE VUODELLE"]
[]
["LIIKEVAIHDON KASVUENNUSTE"]
[null,"Lähtöoletus:",null,"Vuodet:"]
[null,null,null,1,2,3,4,5]
["Ensimmäisen vuoden liikevaihto",{"$f":"+K!F62","v":215010},null,{"$f":"+$B$8*(1+$B$9)^(D$7-1)","v":215010},{"$f":"+$B$8*(1+$B$9)^(E$7-1)","v":225760.5},237048.52499999999,248900.95125000001,261345.99881250001]
["Liikevaihdon arvioitu kasvuvauhti",{"$f":"+K!G48","v":0.05}]
["Kiinteiden kulujen arvioitu kasvuvauhti",{"$f":"+K!G49","v":0.03}]
[]
[]
["Verokanta",{"$f":"+K!G42","v":0.2}]
["Lyhytaikaisen vieraan pääoman korko-%",{"$f":"+K!G43","v":0.03}]
["Pitkäaikaisen vieraan pääoman korko-%",{"$f":"+K!G44","v":0.02}]
["Voitto-osuus-%  kertyneistä voitoista",{"$f":"+K!G46","v":0.05}]
["Pitkäaikaisen velan lyhennysosuus (%)",{"$f":"+K!G45","v":0.15}]
["Rahoitusomaisuus / Liikevaihto",{"$f":"+K!G47","v":0.05},"Minimitaso","Toimivien yritysten keskiarvo"]
["Vaihto-omaisuus / Liikevaihto",0,"Taso"]
["Myyntisaamisten kasvu-%",0]
["Ostovelkojen kasvu-%",0]
[]
["KASSAVIRTAENNUSTE (Euro)"]
[]
[null,null,null,{"$f":"+D7","v":1},{"$f":"+D25+1","v":2},{"$f":"+E25+1","v":3},4,5]
["Liikevaihto","%-osuus",null,{"$f":"+D8","v":215010},{"$f":"+E8","v":225760.5},{"$f":"+F8","v":237048.52499999999},{"$f":"+G8","v":248900.95125000001},{"$f":"+H8","v":261345.99881250001}]
[" - Muuttuvat kulut"]
["Karkearehu",{"$f":"+K!G71/100","v":8.3717036416910848E-2},null,{"$f":"+$B28*D$26","v":18000},18900,19845,20837.250000000004,21879.112500000003]
["Väkirehu",{"$f":"+K!G72/100","v":1.6743407283382167E-2},null,3599.9999999999995,3779.9999999999995,3968.9999999999995,4167.45,4375.8224999999993]
["Kivennäiset",{"$f":"+K!G73/100","v":1.6743407283382167E-2},null,3599.9999999999995,3779.9999999999995,3968.9999999999995,4167.45,4375.8224999999993]
["Muut ruokintakustannukset",{"$f":"+K!G74/100","v":1.6743407283382167E-2},null,3599.9999999999995,3779.9999999999995,3968.9999999999995,4167.45,4375.8224999999993]
["Kuivikekustannukset",{"$f":"+K!G75/100","v":4.1858518208455424E-2},null,9000,9450,9922.5,10418.625000000002,10939.556250000001]
["Kengitykset",{"$f":"+K!G76/100","v":2.7905678805636946E-2},null,6000,6300,6614.9999999999991,6945.75,7293.0374999999995]
["Madotukset",{"$f":"+K!G77/100","v":2.3254732338030791E-3},null,500.00000000000006,525,551.25,578.81250000000011,607.75312500000007]
["Rokotukset",{"$f":"+K!G78/100","v":4.6509464676061582E-3},null,1000.0000000000001,1050,1102.5,1157.6250000000002,1215.5062500000001]
["Raspaukset",{"$f":"+K!G79/100","v":4.6509464676061582E-3},null,1000.0000000000001,1050,1102.5,1157.6250000000002,1215.5062500000001]
["Muut eläinlääkärikulut",{"$f":"+K!G80/100","v":9.3018929352123164E-3},null,2000.0000000000002,2100,2205,2315.2500000000005,2431.0125000000003]
["Varustekustannukset",{"$f":"+K!G81/100","v":2.3254732338030788E-2},null,5000,5250,5512.4999999999991,5788.125,6077.53125]
["Ratsastuksen opettajien palkat lisineen",{"$f":"+K!G82/100","v":0.21161806427608018},null,45500,47775,50163.75,52671.9375,55305.534375000003]
["Täyshoitohevosten hoitajien palkat lisineen",{"$f":"+K!G83/100","v":5.5811357611273892E-2},null,12000,12600,13229.999999999998,13891.5,14586.074999999999]
["Muut muuttuvat kulut",{"$f":"+K!G84/100","v":9.3018929352123164E-3},null,2000.0000000000002,2100,2205,2315.2500000000005,2431.0125000000003]
[" = Myyntikate (menopohjainen)",{"$f":"+K!G85/100","v":0.4753732384540254},null,{"$f":"+D26-SUM(D28:D41)","v":102210},{"$f":"+E26-SUM(E28:E41)","v":107320.5},112686.52499999999,118320.85125000001,124236.8938125]
[" - Kiinteät kulut"]
["Vuokrakulut",{"$f":"+K!F89","v":0},null,{"$f":"+$B44*(1+$B$10)^(D$25-1)","v":0},0,0,0,0]
["Sähkökulut",{"$f":"+K!F90","v":2400},null,2400,2472,2546.16,2622.5448000000001,2701.2211439999996]
["Vesikulut",{"$f":"+K!F91","v":1200},null,1200,1236,1273.08,1311.2724000000001,1350.6105719999998]
["Pohjien huolto",{"$f":"+K!F92","v":3000},null,3000,3090,3182.7,3278.181,3376.5264299999999]
["Lantalan tyhjennys",{"$f":"+K!F93","v":1200},null,1200,1236,1273.08,1311.2724000000001,1350.6105719999998]
["Kiinteät palkkakustannukset lisineen",{"$f":"+K!F94","v":24000},null,24000,24720,25461.599999999999,26225.448,27012.211439999999]
["Muut kiinteät kulut",{"$f":"+K!F95","v":1200},null,1200,1236,1273.08,1311.2724000000001,1350.6105719999998]
[" = Käyttökate (menopohjainen)",null,null,{"$f":"+D42-SUM(D44:D50)","v":69210},{"$f":"+E42-SUM(E44:E50)","v":73330.5},77676.824999999997,82260.860249999998,87095.103082499991]
["Korkomenot","automaatti",null,{"$f":"+$B$14*C$137+$B$15*C$139","v":5115},{"$f":"+$B$14*D$137+$B$15*D$139","v":4785},{"$f":"+$B$14*E$137+$B$15*E$139","v":4159.5},{"$f":"+$B$14*F$137+$B$15*F$139","v":3627.8250000000003},{"$f":"+$B$14*G$137+$B$15*G$139","v":3175.9012499999999}]
["Verot","automaatti",null,{"$f":"+D118","v":8569.0000000000036},{"$f":"+E118","v":10078.26666666667},{"$f":"+F118","v":11575.45111111111},{"$f":"+G118","v":13010.107744444445},{"$f":"+H118","v":14406.849097209879}]
["Osingot","automaatti",null,0,{"$f":"+D145","v":3213.8000000000011},{"$f":"+E145","v":5068.7633333333351},{"$f":"+F145","v":7130.4153888888895},{"$f":"+G145","v":9375.916168333335}]
[" = Rahoitustulos (menopohjainen)",null,null,{"$f":"+D51-SUM(D52:D54)","v":55526},{"$f":"+E51-SUM(E52:E54)","v":55253.433333333327},56873.110555555555,58492.512116666665,60136.436566956778]
[" - Investoinnit"]
["Hevosten hankinta",{"$f":"+K!F104","v":5000},{"$f":"+B57","v":5000},{"$f":"+B57","v":5000},0,0,0,0]
["Maa- ja vesialueet",{"$f":"+K!F105","v":0},{"$f":"+B58","v":0},{"$f":"+B58","v":0},0,0,0,0]
["Rakennukset ja rakennelmat",{"$f":"+K!F106","v":5000},5000,5000,0,0,0,0]
["Koneet ja kalusto",{"$f":"+K!F107","v":10000},10000,10000,0,0,0,0]
["Muu käyttöomaisuus",{"$f":"+K!F108","v":500},500,500,0,0,0,0]
[" - Kassavirtamuunnos"]
[" = Investointijäämä",null,null,{"$f":"+D55-SUM(D57:D62)","v":35026},{"$f":"+E55-SUM(E57:E62)","v":55253.433333333327},{"$f":"+F55-SUM(F57:F62)","v":56873.110555555555},{"$f":"+G55-SUM(G57:G62)","v":58492.512116666665},{"$f":"+H55-SUM(H57:H62)","v":60136.436566956778}]
[" + Muun rahoitusomaisuuden vähennys","automaatti",null,{"$f":"-$B$18*D$84+C125","v":-750.5},{"$f":"-$B$18*E$84+D125","v":22737.974999999999},{"$f":"-$B$18*F$84+E125","v":46152.00708333333},{"$f":"-$B$18*G$84+F125","v":75848.746326388893},{"$f":"-$B$18*H$84+G125","v":111122.81856493055}]
[" + Muun lyhytaikaisen vieraan pääoman lisäys",{"$f":"+K!F113","v":500},null,{"$f":"+K!F113","v":500},0,0,0,0]
[" + Pitkäaikaisen vieraan pääoman lisäys",{"$f":"+K!F114","v":15000},{"$f":"+K!F31","v":210000},{"$f":"+B66-$B$17*C66","v":-16500},{"$f":"-SUM($B66:D66)*$B$17","v":-31275},{"$f":"-SUM($B66:E66)*$B$17","v":-26583.75},{"$f":"-SUM($B66:F66)*$B$17","v":-22596.1875},{"$f":"-SUM($B66:G66)*$B$17","v":-19206.759374999998}]
[" + Oman pääoman lisäys",{"$f":"+K!F115","v":5000},null,{"$f":"+K!F115","v":5000},0,0,0,0]
[" - Rahoitusomaisuuden lisäys (tasoitus)","automaatti",null,{"$f":"+IF(SUM(D63:D67)>0,-SUM(D63:D67),0)","v":-23275.5},{"$f":"+IF(SUM(E63:E67)>0,-SUM(E63:E67),0)","v":-46716.408333333326},-76441.367638888885,-111745.07094305556,-152052.49575688734]
[" = Netto rahoituksen jälkeen (0)",null,null,{"$f":"+SUM(D63:D68)","v":0},{"$f":"+SUM(E63:E68)","v":0},{"$f":"+SUM(F63:F68)","v":0},{"$f":"+SUM(G63:G68)","v":0},{"$f":"+SUM(H63:H68)","v":0}]
[null,null,null,{"$f":"+IF(D69=0,\" \",\"Huom! Ei 0\")","v":" "},{"$f":"+IF(E69=0,\" \",\"Huom! Ei 0\")","v":" "}," "," "," "]
[null,null,null,"Lyhytaikaisen velan"]
[null,null,null,"lisäykseen"]
[]
["Poistot:","Käyttöomaisuus","Poisto-%","Poisto"]
[{"$f":"+A57","v":"Hevosten hankinta"},{"$f":"+K!F20+K!F104","v":30000},{"$f":"+IF(K!F20=0,0,+K!G20/(K!F20+K!G20))","v":0.16666666666666666},{"$f":"+C75*B75","v":5000}]
[{"$f":"+A58","v":"Maa- ja vesialueet"},{"$f":"+K!F21+K!F105","v":80000},{"$f":"+IF(K!F21=0,0,+K!G21/(K!F21+K!G21))","v":0},{"$f":"+C76*B76","v":0}]
[{"$f":"+A59","v":"Rakennukset ja rakennelmat"},{"$f":"+K!F22+K!F106","v":145000},{"$f":"+IF(K!F22=0,0,+K!G22/(K!F22+K!G22))","v":6.6666666666666666E-2},9666.6666666666661]
[{"$f":"+A60","v":"Koneet ja kalusto"},{"$f":"+K!F23+K!F107","v":25000},{"$f":"+IF(K!F23=0,0,+K!G23/(K!F23+K!G23))","v":0.25},6250]
[{"$f":"+A61","v":"Muu käyttöomaisuus"},{"$f":"+K!F24+K!F108","v":2000},{"$f":"+IF(K!F24=0,0,+K!G24/(K!F24+K!G24))","v":0.16666666666666666},333.33333333333331]
[]
["TULOSLASKELMAENNUSTE (Euro)"]
[null,null,null,"Ennusteet:"]
[null,null,null,{"$f":"+D25","v":1},2,3,4,5]
["Liikevaihto",null,null,215010,225760.5,237048.52499999999,248900.95125000001,261345.99881250001]
[" - Muuttuvat kulut"]
["Karkearehu",null,null,{"$f":"+D28","v":18000},18900,19845,20837.250000000004,21879.112500000003]
["Väkirehu",null,null,3599.9999999999995,3779.9999999999995,3968.9999999999995,4167.45,4375.8224999999993]
["Kivennäiset",null,null,3599.9999999999995,3779.9999999999995,3968.9999999999995,4167.45,4375.8224999999993]
["Muut ruokintakustannukset",null,null,3599.9999999999995,3779.9999999999995,3968.9999999999995,4167.45,4375.8224999999993]
["Kuivikekustannukset",null,null,9000,9450,9922.5,10418.625000000002,10939.556250000001]
["Kengitykset",null,null,6000,6300,6614.9999999999991,6945.75,7293.0374999999995]
["Madotukset",null,null,500.00000000000006,525,551.25,578.81250000000011,607.75312500000007]
["Rokotukset",null,null,1000.0000000000001,1050,1102.5,1157.6250000000002,1215.5062500000001]
["Raspaukset",null,null,1000.0000000000001,1050,1102.5,1157.6250000000002,1215.5062500000001]
["Muut eläinlääkärikulut",null,null,2000.0000000000002,2100,2205,2315.2500000000005,2431.0125000000003]
["Varustekustannukset",null,null,5000,5250,5512.4999999999991,5788.125,6077.53125]
["Ratsastuksen opettajien palkat lisineen",null,null,45500,47775,50163.75,52671.9375,55305.534375000003]
["Täyshoitohevosten hoitajien palkat lisineen",null,null,{"$f":"+D40","v":12000},12600,13229.999999999998,13891.5,14586.074999999999]
["Muut muuttuvat kulut",null,null,{"$f":"+D41","v":2000.0000000000002},2100,2205,2315.2500000000005,2431.0125000000003]
[" = Myyntikate",null,null,{"$f":"+D84-SUM(D86:D99)","v":102210},{"$f":"+E84-SUM(E86:E99)","v":107320.5},{"$f":"+F84-SUM(F86:F99)","v":112686.52499999999},{"$f":"+G84-SUM(G86:G99)","v":118320.85125000001},{"$f":"+H84-SUM(H86:H99)","v":124236.8938125}]
[" - Kiinteät kulut"]
["Vuokrakulut",null,null,{"$f":"+D44","v":0},0,0,0,0]
["Sähkökulut",null,null,2400,2472,2546.16,2622.5448000000001,2701.2211439999996]
["Vesikulut",null,null,1200,1236,1273.08,1311.2724000000001,1350.6105719999998]
["Pohjien huolto",null,null,3000,3090,3182.7,3278.181,3376.5264299999999]
["Lantalan tyhjennys",null,null,1200,1236,1273.08,1311.2724000000001,1350.6105719999998]
["Kiinteät palkkakustannukset lisineen",null,null,24000,24720,25461.599999999999,26225.448,27012.211439999999]
["Muut kiinteät kulut",null,null,1200,1236,1273.08,1311.2724000000001,1350.6105719999998]
[" = Käyttökate",null,null,{"$f":"+D100-SUM(D102:D108)","v":69210},{"$f":"+E100-SUM(E102:E108)","v":73330.5},77676.824999999997,82260.860249999998,87095.103082499991]
[" - Poistot"]
[{"$f":"+A57","v":"Hevosten hankinta"},null,{"$f":"+B75","v":30000},{"$f":"+C127-D127","v":5000},{"$f":"+D127-E127","v":4166.6666666666642},3472.2222222222226,2893.5185185185182,2411.2654320987658]
[{"$f":"+A58","v":"Maa- ja vesialueet"},null,{"$f":"+B76","v":80000},{"$f":"+C128-D128","v":0},0,0,0,0]
[{"$f":"+A59","v":"Rakennukset ja rakennelmat"},null,{"$f":"+B77","v":145000},{"$f":"+C129-D129","v":9666.666666666657},9022.222222222219,8420.7407407407445,7859.3580246913625,7335.40082304526]
[{"$f":"+A60","v":"Koneet ja kalusto"},null,{"$f":"+B78","v":25000},{"$f":"+C130-D130","v":6250},4687.5,3515.625,2636.71875,1977.5390625]
[{"$f":"+A61","v":"Muu käyttöomaisuus"},null,{"$f":"+B79","v":2000},{"$f":"+C131-D131","v":333.33333333333326},277.77777777777783,231.48148148148152,192.90123456790116,160.75102880658437]
[" = Liiketulos",null,null,{"$f":"+D109-SUM(D111:D115)","v":47960.000000000015},{"$f":"+E109-SUM(E111:E115)","v":55176.333333333343},{"$f":"+F109-SUM(F111:F115)","v":62036.755555555545},{"$f":"+G109-SUM(G111:G115)","v":68678.363722222217},{"$f":"+H109-SUM(H111:H115)","v":75210.146736049384}]
[" - Korkokulut",null,null,{"$f":"+D52","v":5115},{"$f":"+E52","v":4785},{"$f":"+F52","v":4159.5},{"$f":"+G52","v":3627.8250000000003},{"$f":"+H52","v":3175.9012499999999}]
[" - Verot",null,null,{"$f":"+IF((D116-D117)>0,$B$13*(D116-D117),0)","v":8569.0000000000036},{"$f":"+IF((E116-E117)>0,$B$13*(E116-E117),0)","v":10078.26666666667},11575.45111111111,13010.107744444445,14406.849097209879]
["Tilikauden tulos",null,null,{"$f":"+D116-SUM(D117:D118)","v":34276.000000000015},{"$f":"+E116-SUM(E117:E118)","v":40313.066666666673},46301.804444444439,52040.430977777767,57627.396388839508]
[]
["TASE-ENNUSTE (Euro)"]
[]
["Taseen omaisuus",null,null,"Ennusteet:"]
["Lyhytaikainen:",null,null,{"$f":"+D83","v":1},{"$f":"+E83","v":2},{"$f":"+F83","v":3},{"$f":"+G83","v":4},{"$f":"+H83","v":5}]
["Rahoitusomaisuus ja muu lyhytaikainen omaisuus",null,{"$f":"+K!F14","v":10000},{"$f":"+$B$18*D84-D68","v":34026},{"$f":"+$B$18*E84-E68","v":58004.433333333327},{"$f":"+$B$18*F84-F68","v":88293.793888888889},{"$f":"+$B$18*G84-G68","v":124190.11850555555},{"$f":"+$B$18*H84-H68","v":165119.79569751234}]
["Pitkäaikainen:"]
[{"$f":"+A57","v":"Hevosten hankinta"},null,{"$f":"+B75","v":30000},{"$f":"+C127*(1-$C75)","v":25000},{"$f":"+D127*(1-$C75)","v":20833.333333333336},17361.111111111113,14467.592592592595,12056.327160493829]
[{"$f":"+A58","v":"Maa- ja vesialueet"},null,{"$f":"+B76","v":80000},{"$f":"+C128*(1-$C76)","v":80000},80000,80000,80000,80000]
[{"$f":"+A59","v":"Rakennukset ja rakennelmat"},null,{"$f":"+B77","v":145000},{"$f":"+C129*(1-$C77)","v":135333.33333333334},126311.11111111112,117890.37037037038,110031.01234567902,102695.61152263376]
[{"$f":"+A60","v":"Koneet ja kalusto"},null,{"$f":"+B78","v":25000},{"$f":"+C130*(1-$C78)","v":18750},14062.5,10546.875,7910.15625,5932.6171875]
[{"$f":"+A61","v":"Muu käyttöomaisuus"},null,{"$f":"+B79","v":2000},{"$f":"+C131*(1-$C79)","v":1666.6666666666667},1388.8888888888889,1157.4074074074074,964.50617283950623,803.75514403292186]
["Yhteensä",null,null,{"$f":"+D125+SUM(D127:D131)","v":294776},{"$f":"+E125+SUM(E127:E131)","v":300600.26666666666},{"$f":"+F125+SUM(F127:F131)","v":315249.55777777778},{"$f":"+G125+SUM(G127:G131)","v":337563.38586666668},{"$f":"+H125+SUM(H127:H131)","v":366608.10671217286}]
[]
["Taseen pääoma"]
["Lyhytaikainen:"]
["Lyhytaikaiset velat (maks. voitto-osuus)",null,null,{"$f":"+D145","v":3213.8000000000011},{"$f":"+E145","v":5068.7633333333351},7130.4153888888895,9375.916168333335,11788.490179358645]
["Muu lyhytaikainen vieras pääoma",null,{"$f":"+B65+K!F30","v":20500},{"$f":"+C137-D69","v":20500},{"$f":"+D137-E69","v":20500},{"$f":"+E137-F69","v":20500},{"$f":"+F137-G69","v":20500},{"$f":"+G137-H69","v":20500}]
["Pitkäaikainen:"]
["Pitkäaikainen vieras pääoma",null,{"$f":"+B66+K!F31","v":225000},{"$f":"+C139+D66","v":208500},{"$f":"+D139+E66","v":177225},{"$f":"+E139+F66","v":150641.25},128045.0625,108838.30312500001]
["Sijoitettu oma pääoma",null,{"$f":"+B67+K!F33","v":16500},{"$f":"+C140","v":16500},{"$f":"+D140+E67","v":16500},{"$f":"+E140+F67","v":16500},{"$f":"+F140+G67","v":16500},{"$f":"+G140+H67","v":16500}]
["Kertyneet voittovarat ja muu oma pääoma",null,{"$f":"+D119+K!F32","v":64276.000000000015},{"$f":"+C141-D145","v":61062.200000000012},{"$f":"+D141+E119-E145","v":96306.503333333356},{"$f":"+E141+F119-F145","v":135477.8923888889},{"$f":"+F141+G119-G145","v":178142.40719833336},{"$f":"+G141+H119-H145","v":223981.31340781425}]
["Yhteensä",null,null,{"$f":"+SUM(D136:D141)","v":309776},315600.26666666672,330249.55777777778,352563.38586666668,381608.10671217291]
[]
["Lisätietoja:",null,null,"Laskettu:"]
["Osingot kertyneistä voitoista",{"$f":"+B16","v":0.05},null,{"$f":"+IF(C141-$B145*C141>0,$B145*C141,IF(C141>0,C141,0))","v":3213.8000000000011},{"$f":"+IF(D141-$B145*D141+E119>0,$B145*(D141+E119),IF(D141+E119>0,D141+E119,0))","v":5068.7633333333351},{"$f":"+IF(E141-$B145*E141+F119>0,$B145*(E141+F119),IF(E141+F119>0,E141+F119,0))","v":7130.4153888888895},{"$f":"+IF(F141-$B145*F141+G119>0,$B145*(F141+G119),IF(F141+G119>0,F141+G119,0))","v":9375.916168333335},{"$f":"+IF(G141-$B145*G141+H119>0,$B145*(G141+H119),IF(G141+H119>0,G141+H119,0))","v":11788.490179358645}]
[]
[null,null,"Tarkistus",{"$f":"0.05*(D141+D136)","v":3213.8000000000011},{"$f":"0.05*(E141+E136)","v":5068.7633333333351},7130.4153888888895,9375.916168333335,11788.490179358645]
[]
[]
["TILINPÄÄTÖKSEN TUNNUSLUVUT"]
[null,null,null,{"$f":"+D25","v":1},{"$f":"+E25","v":2},{"$f":"+F25","v":3},{"$f":"+G25","v":4},{"$f":"+H25","v":5}]
["Koko"]
["1. Liikevaihto (Euro)",null,null,{"$f":"+D84","v":215010},{"$f":"+E84","v":225760.5},{"$f":"+F84","v":237048.52499999999},{"$f":"+G84","v":248900.95125000001},{"$f":"+H84","v":261345.99881250001}]
["2. Taseen loppusumma (Euro)",null,null,{"$f":"+D132","v":294776},{"$f":"+E132","v":300600.26666666666},{"$f":"+F132","v":315249.55777777778},{"$f":"+G132","v":337563.38586666668},{"$f":"+H132","v":366608.10671217286}]
["3. Tilikauden tulos (Euro)",null,null,{"$f":"+D119","v":34276.000000000015},{"$f":"+E119","v":40313.066666666673},{"$f":"+F119","v":46301.804444444439},{"$f":"+G119","v":52040.430977777767},{"$f":"+H119","v":57627.396388839508}]
["4. Voitto-osuus omistajalle (Euro)",null,null,{"$f":"+D145","v":3213.8000000000011},{"$f":"+E145","v":5068.7633333333351},7130.4153888888895,9375.916168333335,11788.490179358645]
[]
["Kasvu"]
["1. Liikevaihdon kasvu-%",null,null,null,{"$f":"100*E84/D84-100","v":5},{"$f":"100*F84/E84-100","v":5},{"$f":"100*G84/F84-100","v":5},{"$f":"100*H84/G84-100","v":5}]
["2. Taseen loppusumman kasvu-%",null,null,null,{"$f":"100*E132/D132-100","v":1.9758279733311639},{"$f":"100*F132/E132-100","v":4.8733460131476107},{"$f":"100*G132/F132-100","v":7.0781473084945929},{"$f":"100*H132/G132-100","v":8.6042272537752353}]
["3. Tilikauden tuloksen kasvu-%",null,null,null,{"$f":"100*(E119)/(D119)-100","v":17.613101489866551},{"$f":"100*(F119)/(E119)-100","v":14.855574812247227},{"$f":"100*(G119)/(F119)-100","v":12.393958728366314},{"$f":"100*(H119)/(G119)-100","v":10.735816952491192}]
[]
["Kannattavuus"]
["1. Käyttökate / Liikevaihto (%)",null,null,{"$f":"100*D109/D84","v":32.189200502302221},{"$f":"100*E109/E84","v":32.481545708837466},{"$f":"100*F109/F84","v":32.76832243524823},{"$f":"100*G109/G84","v":33.049636747822589},{"$f":"100*H109/H84","v":33.3255926925384}]
["2. Liiketulos / Liikevaihto (%)",null,null,{"$f":"100*D116/D84","v":22.305939258639143},{"$f":"100*E116/E84","v":24.44020691544063},{"$f":"100*F116/F84","v":26.170487901392992},{"$f":"100*G116/G84","v":27.592648150725864},{"$f":"100*H116/H84","v":28.777998162507981}]
["3. Tilikauden tulos / Liikevaihto (%)",null,null,{"$f":"100*D119/D84","v":15.941584112366874},{"$f":"100*E119/E84","v":17.856563334448087},{"$f":"100*F119/F84","v":19.532627104279364},{"$f":"100*G119/G84","v":20.908088424904225},{"$f":"100*H119/H84","v":22.050230977587567}]
["4. Sijoitetun pääoman tuotto-%",null,null,null,{"$f":"100*(E119+E118+E117)/D132","v":18.718054839380866},{"$f":"100*(F119+F118+F117)/E132","v":20.637624924114796},{"$f":"100*(G119+G118+G117)/F132","v":21.785395737377751},{"$f":"100*(H119+H118+H117)/G132","v":22.280303458549991}]
["5. Oman pääoman tuotto-%",null,null,null,{"$f":"+IF(D140+D141>0,100*(E119)/(D140+D141),\"\")","v":51.975145968869718},{"$f":"+IF(E140+E141>0,100*(F119)/(E140+E141),\"\")","v":41.045332561746598},34.242105979871084,29.606804199723722]
[]
["Maksuvalmius"]
["1. Rahoitustulos / Liikevaihto",null,null,{"$f":"100*(D119+SUM(D111:D115))/D84","v":25.824845356029954},{"$f":"100*(E119+SUM(E111:E115))/E84","v":25.897902127844922},{"$f":"100*(F119+SUM(F111:F115))/F84","v":26.130461638134594},{"$f":"100*(G119+SUM(G111:G115))/G84","v":26.365077022000953},{"$f":"100*(H119+SUM(H111:H115))/H84","v":26.597825507617983}]
["2. Quick ratio",null,null,{"$f":"+(D125)/(D136+D137)","v":1.4348607140146241},{"$f":"+(E125)/(E136+E137)","v":2.268566241438609},{"$f":"+(F125)/(F136+F137)","v":3.1955290083838102},{"$f":"+(G125)/(G136+G137)","v":4.1568639370192626},{"$f":"+(H125)/(H136+H137)","v":5.1138902680271485}]
[]
["Vakavaraisuus"]
["1. Omavaraisuusaste",null,null,{"$f":"100*(D140+D141)/D142","v":25.038156603481227},{"$f":"100*(E140+E141)/E142","v":35.743475290684167},46.019105494504117,55.207776814335375,63.01787335697162]
["2. Rahoitustulos / Velat (%)",null,null,{"$f":"100*(D119+SUM(D111:D115))/(+D136+D137+D139)","v":23.911584927338513},{"$f":"100*(E119+SUM(E111:E115))/(+E136+E137+E139)","v":28.830883342911484},{"$f":"100*(F119+SUM(F111:F115))/(+F136+F137+F139)","v":34.745776202722084},{"$f":"100*(G119+SUM(G111:G115))/(+G136+G137+G139)","v":41.554281172090029},{"$f":"100*(H119+SUM(H111:H115))/(+H136+H137+H139)","v":49.255248495144009}]
[]
["Rahoitusriski"]
["1. Kolmen muuttujan P-luku ","Kriittinen arvo P* = 0,50",null,{"$f":"1/(1+EXP(-(0.843-0.027*D175-0.039*D172-0.01*D171)))","v":0.46325679358003691},{"$f":"1/(1+EXP(-(0.843-0.027*E175-0.039*E172-0.01*E171)))","v":0.38472821725788009},{"$f":"1/(1+EXP(-(0.843-0.027*F175-0.039*F172-0.01*F171)))","v":0.31314731630883941},{"$f":"1/(1+EXP(-(0.843-0.027*G175-0.039*G172-0.01*G171)))","v":0.25476112982336069},{"$f":"1/(1+EXP(-(0.843-0.027*H175-0.039*H172-0.01*H171)))","v":0.21016974257354773}]
[null,"Tulkintalause",null,{"$f":"+IF(D179>0.65,\"Erittäin suuri riski\",IF(D179>0.45,\"Suuri riski\",IF(D179>0.25,\"Kohtuullinen riski\",IF(D179>0.1,\"Suhteellisen pieni riski\",\"Pieni riski\"))))","v":"Suuri riski"},{"$f":"+IF(E179>0.65,\"Erittäin suuri riski\",IF(E179>0.45,\"Suuri riski\",IF(E179>0.25,\"Kohtuullinen riski\",IF(E179>0.1,\"Suhteellisen pieni riski\",\"Pieni riski\"))))","v":"Kohtuullinen riski"},"Kohtuullinen riski","Kohtuullinen riski","Suhteellisen pieni riski"]

{"sheet":"T","index":2,"n_rows":167,"n_cols":15,"rows_kept":167,"cut":false,"hidden":true,"merged":[]}
[null," Copyright Vaasan Yritysinformaatio Oy. Kaikki tekijänoikeudet pidätetään."]
[]
[null,"ENNAKOITU TULOSLASKELMA"]
[null,null,"Ennakoidut viisi vuotta:"]
[null,null,1,2,3,4,5]
[null,{"$f":"+E!A84","v":"Liikevaihto"},{"$f":"+E!D84","v":215010},{"$f":"+E!E84","v":225760.5},{"$f":"+E!F84","v":237048.52499999999},{"$f":"+E!G84","v":248900.95125000001},{"$f":"+E!H84","v":261345.99881250001}]
[null,{"$f":"+E!A85","v":" - Muuttuvat kulut"}]
[null,{"$f":"+E!A86","v":"Karkearehu"},{"$f":"+E!D86","v":18000},{"$f":"+E!E86","v":18900},{"$f":"+E!F86","v":19845},{"$f":"+E!G86","v":20837.250000000004},{"$f":"+E!H86","v":21879.112500000003}]
[null,{"$f":"+E!A87","v":"Väkirehu"},{"$f":"+E!D87","v":3599.9999999999995},{"$f":"+E!E87","v":3779.9999999999995},{"$f":"+E!F87","v":3968.9999999999995},{"$f":"+E!G87","v":4167.45},{"$f":"+E!H87","v":4375.8224999999993}]
[null,{"$f":"+E!A88","v":"Kivennäiset"},{"$f":"+E!D88","v":3599.9999999999995},{"$f":"+E!E88","v":3779.9999999999995},{"$f":"+E!F88","v":3968.9999999999995},{"$f":"+E!G88","v":4167.45},{"$f":"+E!H88","v":4375.8224999999993}]
[null,{"$f":"+E!A89","v":"Muut ruokintakustannukset"},{"$f":"+E!D89","v":3599.9999999999995},{"$f":"+E!E89","v":3779.9999999999995},{"$f":"+E!F89","v":3968.9999999999995},{"$f":"+E!G89","v":4167.45},{"$f":"+E!H89","v":4375.8224999999993}]
[null,{"$f":"+E!A90","v":"Kuivikekustannukset"},{"$f":"+E!D90","v":9000},{"$f":"+E!E90","v":9450},{"$f":"+E!F90","v":9922.5},{"$f":"+E!G90","v":10418.625000000002},{"$f":"+E!H90","v":10939.556250000001}]
[null,{"$f":"+E!A91","v":"Kengitykset"},{"$f":"+E!D91","v":6000},{"$f":"+E!E91","v":6300},{"$f":"+E!F91","v":6614.9999999999991},{"$f":"+E!G91","v":6945.75},{"$f":"+E!H91","v":7293.0374999999995}]
[null,{"$f":"+E!A92","v":"Madotukset"},{"$f":"+E!D92","v":500.00000000000006},{"$f":"+E!E92","v":525},{"$f":"+E!F92","v":551.25},{"$f":"+E!G92","v":578.81250000000011},{"$f":"+E!H92","v":607.75312500000007}]
[null,{"$f":"+E!A93","v":"Rokotukset"},{"$f":"+E!D93","v":1000.0000000000001},{"$f":"+E!E93","v":1050},{"$f":"+E!F93","v":1102.5},{"$f":"+E!G93","v":1157.6250000000002},{"$f":"+E!H93","v":1215.5062500000001}]
[null,{"$f":"+E!A94","v":"Raspaukset"},{"$f":"+E!D94","v":1000.0000000000001},{"$f":"+E!E94","v":1050},{"$f":"+E!F94","v":1102.5},{"$f":"+E!G94","v":1157.6250000000002},{"$f":"+E!H94","v":1215.5062500000001}]
[null,{"$f":"+E!A95","v":"Muut eläinlääkärikulut"},{"$f":"+E!D95","v":2000.0000000000002},{"$f":"+E!E95","v":2100},{"$f":"+E!F95","v":2205},{"$f":"+E!G95","v":2315.2500000000005},{"$f":"+E!H95","v":2431.0125000000003}]
[null,{"$f":"+E!A96","v":"Varustekustannukset"},{"$f":"+E!D96","v":5000},{"$f":"+E!E96","v":5250},{"$f":"+E!F96","v":5512.4999999999991},{"$f":"+E!G96","v":5788.125},{"$f":"+E!H96","v":6077.53125}]
[null,{"$f":"+E!A97","v":"Ratsastuksen opettajien palkat lisineen"},{"$f":"+E!D97","v":45500},{"$f":"+E!E97","v":47775},{"$f":"+E!F97","v":50163.75},{"$f":"+E!G97","v":52671.9375},{"$f":"+E!H97","v":55305.534375000003}]
[null,{"$f":"+E!A98","v":"Täyshoitohevosten hoitajien palkat lisineen"},{"$f":"+E!D98","v":12000},{"$f":"+E!E98","v":12600},{"$f":"+E!F98","v":13229.999999999998},{"$f":"+E!G98","v":13891.5},{"$f":"+E!H98","v":14586.074999999999}]
[null,{"$f":"+E!A99","v":"Muut muuttuvat kulut"},{"$f":"+E!D99","v":2000.0000000000002},{"$f":"+E!E99","v":2100},{"$f":"+E!F99","v":2205},{"$f":"+E!G99","v":2315.2500000000005},{"$f":"+E!H99","v":2431.0125000000003}]
[null,{"$f":"+E!A100","v":" = Myyntikate"},{"$f":"+E!D100","v":102210},{"$f":"+E!E100","v":107320.5},{"$f":"+E!F100","v":112686.52499999999},{"$f":"+E!G100","v":118320.85125000001},{"$f":"+E!H100","v":124236.8938125}]
[null,{"$f":"+E!A101","v":" - Kiinteät kulut"}]
[null,{"$f":"+E!A102","v":"Vuokrakulut"},{"$f":"+E!D102","v":0},{"$f":"+E!E102","v":0},{"$f":"+E!F102","v":0},{"$f":"+E!G102","v":0},{"$f":"+E!H102","v":0}]
[null,{"$f":"+E!A103","v":"Sähkökulut"},{"$f":"+E!D103","v":2400},{"$f":"+E!E103","v":2472},{"$f":"+E!F103","v":2546.16},{"$f":"+E!G103","v":2622.5448000000001},{"$f":"+E!H103","v":2701.2211439999996}]
[null,{"$f":"+E!A104","v":"Vesikulut"},{"$f":"+E!D104","v":1200},{"$f":"+E!E104","v":1236},{"$f":"+E!F104","v":1273.08},{"$f":"+E!G104","v":1311.2724000000001},{"$f":"+E!H104","v":1350.6105719999998}]
[null,{"$f":"+E!A105","v":"Pohjien huolto"},{"$f":"+E!D105","v":3000},{"$f":"+E!E105","v":3090},{"$f":"+E!F105","v":3182.7},{"$f":"+E!G105","v":3278.181},{"$f":"+E!H105","v":3376.5264299999999}]
[null,{"$f":"+E!A106","v":"Lantalan tyhjennys"},{"$f":"+E!D106","v":1200},{"$f":"+E!E106","v":1236},{"$f":"+E!F106","v":1273.08},{"$f":"+E!G106","v":1311.2724000000001},{"$f":"+E!H106","v":1350.6105719999998}]
[null,{"$f":"+E!A107","v":"Kiinteät palkkakustannukset lisineen"},{"$f":"+E!D107","v":24000},{"$f":"+E!E107","v":24720},{"$f":"+E!F107","v":25461.599999999999},{"$f":"+E!G107","v":26225.448},{"$f":"+E!H107","v":27012.211439999999}]
[null,"Muut kiinteät kulut",{"$f":"+E!D108","v":1200},{"$f":"+E!E108","v":1236},{"$f":"+E!F108","v":1273.08},{"$f":"+E!G108","v":1311.2724000000001},{"$f":"+E!H108","v":1350.6105719999998}]
[null,{"$f":"+E!A109","v":" = Käyttökate"},{"$f":"+E!D109","v":69210},{"$f":"+E!E109","v":73330.5},{"$f":"+E!F109","v":77676.824999999997},{"$f":"+E!G109","v":82260.860249999998},{"$f":"+E!H109","v":87095.103082499991}]
[null,{"$f":"+E!A110","v":" - Poistot"}]
[null,{"$f":"+E!A111","v":"Hevosten hankinta"},{"$f":"+E!D111","v":5000},{"$f":"+E!E111","v":4166.6666666666642},{"$f":"+E!F111","v":3472.2222222222226},{"$f":"+E!G111","v":2893.5185185185182},{"$f":"+E!H111","v":2411.2654320987658}]
[null,{"$f":"+E!A112","v":"Maa- ja vesialueet"},{"$f":"+E!D112","v":0},{"$f":"+E!E112","v":0},{"$f":"+E!F112","v":0},{"$f":"+E!G112","v":0},{"$f":"+E!H112","v":0}]
[null,{"$f":"+E!A113","v":"Rakennukset ja rakennelmat"},{"$f":"+E!D113","v":9666.666666666657},{"$f":"+E!E113","v":9022.222222222219},{"$f":"+E!F113","v":8420.7407407407445},{"$f":"+E!G113","v":7859.3580246913625},{"$f":"+E!H113","v":7335.40082304526}]
[null,{"$f":"+E!A114","v":"Koneet ja kalusto"},{"$f":"+E!D114","v":6250},{"$f":"+E!E114","v":4687.5},{"$f":"+E!F114","v":3515.625},{"$f":"+E!G114","v":2636.71875},{"$f":"+E!H114","v":1977.5390625}]
[null,{"$f":"+E!#REF!","v":{"$error":"#REF!"}},{"$f":"+E!#REF!","v":{"$error":"#REF!"}},{"$f":"+E!#REF!","v":{"$error":"#REF!"}},{"$f":"+E!#REF!","v":{"$error":"#REF!"}},{"$f":"+E!#REF!","v":{"$error":"#REF!"}},{"$f":"+E!#REF!","v":{"$error":"#REF!"}}]
[null,{"$f":"+E!A115","v":"Muu käyttöomaisuus"},{"$f":"+E!D115","v":333.33333333333326},{"$f":"+E!E115","v":277.77777777777783},{"$f":"+E!F115","v":231.48148148148152},{"$f":"+E!G115","v":192.90123456790116},{"$f":"+E!H115","v":160.75102880658437}]
[null,{"$f":"+E!A116","v":" = Liiketulos"},{"$f":"+E!D116","v":47960.000000000015},{"$f":"+E!E116","v":55176.333333333343},{"$f":"+E!F116","v":62036.755555555545},{"$f":"+E!G116","v":68678.363722222217},{"$f":"+E!H116","v":75210.146736049384}]
[null,{"$f":"+E!A117","v":" - Korkokulut"},{"$f":"+E!D117","v":5115},{"$f":"+E!E117","v":4785},{"$f":"+E!F117","v":4159.5},{"$f":"+E!G117","v":3627.8250000000003},{"$f":"+E!H117","v":3175.9012499999999}]
[null,{"$f":"+E!A118","v":" - Verot"},{"$f":"+E!D118","v":8569.0000000000036},{"$f":"+E!E118","v":10078.26666666667},{"$f":"+E!F118","v":11575.45111111111},{"$f":"+E!G118","v":13010.107744444445},{"$f":"+E!H118","v":14406.849097209879}]
[null,{"$f":"+E!A119","v":"Tilikauden tulos"},{"$f":"+E!D119","v":34276.000000000015},{"$f":"+E!E119","v":40313.066666666673},{"$f":"+E!F119","v":46301.804444444439},{"$f":"+E!G119","v":52040.430977777767},{"$f":"+E!H119","v":57627.396388839508}]
[]
[null,"ENNAKOITU TASE"]
[null,null,{"$f":"+C4","v":"Ennakoidut viisi vuotta:"}]
[null,null,1,2,3,4,5]
[null,{"$f":"+E!A123","v":"Taseen omaisuus"}]
[null,{"$f":"+E!A124","v":"Lyhytaikainen:"}]
[null,{"$f":"+E!A125","v":"Rahoitusomaisuus ja muu lyhytaikainen omaisuus"},{"$f":"+E!D125","v":34026},{"$f":"+E!E125","v":58004.433333333327},{"$f":"+E!F125","v":88293.793888888889},{"$f":"+E!G125","v":124190.11850555555},{"$f":"+E!H125","v":165119.79569751234}]
[null,{"$f":"+E!A126","v":"Pitkäaikainen:"}]
[null,{"$f":"+E!A127","v":"Hevosten hankinta"},{"$f":"+E!D127","v":25000},{"$f":"+E!E127","v":20833.333333333336},{"$f":"+E!F127","v":17361.111111111113},{"$f":"+E!G127","v":14467.592592592595},{"$f":"+E!H127","v":12056.327160493829}]
[null,{"$f":"+E!A128","v":"Maa- ja vesialueet"},{"$f":"+E!D128","v":80000},{"$f":"+E!E128","v":80000},{"$f":"+E!F128","v":80000},{"$f":"+E!G128","v":80000},{"$f":"+E!H128","v":80000}]
[null,{"$f":"+E!A129","v":"Rakennukset ja rakennelmat"},{"$f":"+E!D129","v":135333.33333333334},{"$f":"+E!E129","v":126311.11111111112},{"$f":"+E!F129","v":117890.37037037038},{"$f":"+E!G129","v":110031.01234567902},{"$f":"+E!H129","v":102695.61152263376}]
[null,{"$f":"+E!A130","v":"Koneet ja kalusto"},{"$f":"+E!D130","v":18750},{"$f":"+E!E130","v":14062.5},{"$f":"+E!F130","v":10546.875},{"$f":"+E!G130","v":7910.15625},{"$f":"+E!H130","v":5932.6171875}]
[null,{"$f":"+E!#REF!","v":{"$error":"#REF!"}},{"$f":"+E!#REF!","v":{"$error":"#REF!"}},{"$f":"+E!#REF!","v":{"$error":"#REF!"}},{"$f":"+E!#REF!","v":{"$error":"#REF!"}},{"$f":"+E!#REF!","v":{"$error":"#REF!"}},{"$f":"+E!#REF!","v":{"$error":"#REF!"}}]
[null,{"$f":"+E!A131","v":"Muu käyttöomaisuus"},{"$f":"+E!D131","v":1666.6666666666667},{"$f":"+E!E131","v":1388.8888888888889},{"$f":"+E!F131","v":1157.4074074074074},{"$f":"+E!G131","v":964.50617283950623},{"$f":"+E!H131","v":803.75514403292186}]
[null,{"$f":"+E!A132","v":"Yhteensä"},{"$f":"+E!D132","v":294776},{"$f":"+E!E132","v":300600.26666666666},{"$f":"+E!F132","v":315249.55777777778},{"$f":"+E!G132","v":337563.38586666668},{"$f":"+E!H132","v":366608.10671217286}]
[]
[null,{"$f":"+E!A134","v":"Taseen pääoma"}]
[null,{"$f":"+E!A135","v":"Lyhytaikainen:"}]
[null,{"$f":"+E!A136","v":"Lyhytaikaiset velat (maks. voitto-osuus)"},{"$f":"+E!D136","v":3213.8000000000011},{"$f":"+E!E136","v":5068.7633333333351},{"$f":"+E!F136","v":7130.4153888888895},{"$f":"+E!G136","v":9375.916168333335},{"$f":"+E!H136","v":11788.490179358645}]
[null,{"$f":"+E!A137","v":"Muu lyhytaikainen vieras pääoma"},{"$f":"+E!D137","v":20500},{"$f":"+E!E137","v":20500},{"$f":"+E!F137","v":20500},{"$f":"+E!G137","v":20500},{"$f":"+E!H137","v":20500}]
[null,{"$f":"+E!A138","v":"Pitkäaikainen:"}]
[null,{"$f":"+E!A139","v":"Pitkäaikainen vieras pääoma"},{"$f":"+E!D139","v":208500},{"$f":"+E!E139","v":177225},{"$f":"+E!F139","v":150641.25},{"$f":"+E!G139","v":128045.0625},{"$f":"+E!H139","v":108838.30312500001}]
[null,{"$f":"+E!A140","v":"Sijoitettu oma pääoma"},{"$f":"+E!D140","v":16500},{"$f":"+E!E140","v":16500},{"$f":"+E!F140","v":16500},{"$f":"+E!G140","v":16500},{"$f":"+E!H140","v":16500}]
[null,{"$f":"+E!A141","v":"Kertyneet voittovarat ja muu oma pääoma"},{"$f":"+E!D141","v":61062.200000000012},{"$f":"+E!E141","v":96306.503333333356},{"$f":"+E!F141","v":135477.8923888889},{"$f":"+E!G141","v":178142.40719833336},{"$f":"+E!H141","v":223981.31340781425}]
[null,{"$f":"+E!A142","v":"Yhteensä"},{"$f":"+E!D142","v":309776},{"$f":"+E!E142","v":315600.26666666672},{"$f":"+E!F142","v":330249.55777777778},{"$f":"+E!G142","v":352563.38586666668},{"$f":"+E!H142","v":381608.10671217291}]
[]
[null,"ENNAKOIDUT TUNNUSLUVUT"]
[null,null,{"$f":"+C4","v":"Ennakoidut viisi vuotta:"}]
[null,null,{"$f":"+E!D151","v":1},{"$f":"+E!E151","v":2},{"$f":"+E!F151","v":3},{"$f":"+E!G151","v":4},{"$f":"+E!H151","v":5}]
[null,"Koko"]
[null,{"$f":"+E!A153","v":"1. Liikevaihto (Euro)"},{"$f":"+E!D153","v":215010},{"$f":"+E!E153","v":225760.5},{"$f":"+E!F153","v":237048.52499999999},{"$f":"+E!G153","v":248900.95125000001},{"$f":"+E!H153","v":261345.99881250001}]
[null,{"$f":"+E!A154","v":"2. Taseen loppusumma (Euro)"},{"$f":"+E!D154","v":294776},{"$f":"+E!E154","v":300600.26666666666},{"$f":"+E!F154","v":315249.55777777778},{"$f":"+E!G154","v":337563.38586666668},{"$f":"+E!H154","v":366608.10671217286}]
[null,{"$f":"+E!A155","v":"3. Tilikauden tulos (Euro)"},{"$f":"+E!D155","v":34276.000000000015},{"$f":"+E!E155","v":40313.066666666673},{"$f":"+E!F155","v":46301.804444444439},{"$f":"+E!G155","v":52040.430977777767},{"$f":"+E!H155","v":57627.396388839508}]
[null,{"$f":"+E!A156","v":"4. Voitto-osuus omistajalle (Euro)"},{"$f":"+E!D156","v":3213.8000000000011},{"$f":"+E!E156","v":5068.7633333333351},{"$f":"+E!F156","v":7130.4153888888895},{"$f":"+E!G156","v":9375.916168333335},{"$f":"+E!H156","v":11788.490179358645}]
[]
[null,{"$f":"+E!A158","v":"Kasvu"}]
[null,{"$f":"+E!A159","v":"1. Liikevaihdon kasvu-%"},null,{"$f":"+E!E159","v":5},{"$f":"+E!F159","v":5},{"$f":"+E!G159","v":5},{"$f":"+E!H159","v":5}]
[null,{"$f":"+E!A160","v":"2. Taseen loppusumman kasvu-%"},null,{"$f":"+E!E160","v":1.9758279733311639},{"$f":"+E!F160","v":4.8733460131476107},{"$f":"+E!G160","v":7.0781473084945929},{"$f":"+E!H160","v":8.6042272537752353}]
[null,{"$f":"+E!A161","v":"3. Tilikauden tuloksen kasvu-%"},null,{"$f":"+E!E161","v":17.613101489866551},{"$f":"+E!F161","v":14.855574812247227},{"$f":"+E!G161","v":12.393958728366314},{"$f":"+E!H161","v":10.735816952491192}]
[]
[null,{"$f":"+E!A163","v":"Kannattavuus"}]
[null,{"$f":"+E!A164","v":"1. Käyttökate / Liikevaihto (%)"},{"$f":"+E!D164","v":32.189200502302221},{"$f":"+E!E164","v":32.481545708837466},{"$f":"+E!F164","v":32.76832243524823},{"$f":"+E!G164","v":33.049636747822589},{"$f":"+E!H164","v":33.3255926925384}]
[null,{"$f":"+E!A165","v":"2. Liiketulos / Liikevaihto (%)"},{"$f":"+E!D165","v":22.305939258639143},{"$f":"+E!E165","v":24.44020691544063},{"$f":"+E!F165","v":26.170487901392992},{"$f":"+E!G165","v":27.592648150725864},{"$f":"+E!H165","v":28.777998162507981}]
[null,{"$f":"+E!A166","v":"3. Tilikauden tulos / Liikevaihto (%)"},{"$f":"+E!D166","v":15.941584112366874},{"$f":"+E!E166","v":17.856563334448087},{"$f":"+E!F166","v":19.532627104279364},{"$f":"+E!G166","v":20.908088424904225},{"$f":"+E!H166","v":22.050230977587567}]
[null,{"$f":"+E!A167","v":"4. Sijoitetun pääoman tuotto-%"},null,{"$f":"+E!E167","v":18.718054839380866},{"$f":"+E!F167","v":20.637624924114796},{"$f":"+E!G167","v":21.785395737377751},{"$f":"+E!H167","v":22.280303458549991}]
[null,{"$f":"+E!A168","v":"5. Oman pääoman tuotto-%"},null,{"$f":"+E!E168","v":51.975145968869718},{"$f":"+E!F168","v":41.045332561746598},{"$f":"+E!G168","v":34.242105979871084},{"$f":"+E!H168","v":29.606804199723722}]
[]
[null,{"$f":"+E!A170","v":"Maksuvalmius"}]
[null,{"$f":"+E!A171","v":"1. Rahoitustulos / Liikevaihto"},{"$f":"+E!D171","v":25.824845356029954},{"$f":"+E!E171","v":25.897902127844922},{"$f":"+E!F171","v":26.130461638134594},{"$f":"+E!G171","v":26.365077022000953},{"$f":"+E!H171","v":26.597825507617983}]
[null,{"$f":"+E!A172","v":"2. Quick ratio"},{"$f":"+E!D172","v":1.4348607140146241},{"$f":"+E!E172","v":2.268566241438609},{"$f":"+E!F172","v":3.1955290083838102},{"$f":"+E!G172","v":4.1568639370192626},{"$f":"+E!H172","v":5.1138902680271485}]
[]
[null,{"$f":"+E!A174","v":"Vakavaraisuus"}]
[null,{"$f":"+E!A175","v":"1. Omavaraisuusaste"},{"$f":"+E!D175","v":25.038156603481227},{"$f":"+E!E175","v":35.743475290684167},{"$f":"+E!F175","v":46.019105494504117},{"$f":"+E!G175","v":55.207776814335375},{"$f":"+E!H175","v":63.01787335697162}]
[null,{"$f":"+E!A176","v":"2. Rahoitustulos / Velat (%)"},{"$f":"+E!D176","v":23.911584927338513},{"$f":"+E!E176","v":28.830883342911484},{"$f":"+E!F176","v":34.745776202722084},{"$f":"+E!G176","v":41.554281172090029},{"$f":"+E!H176","v":49.255248495144009}]
[]
[null,"Rahoitusriski: Taipumus kuulua konkurssiyritysten (1) tai toimivien yritysten (0) joukkoon"]
[null,{"$f":"+E!A179","v":"1. Kolmen muuttujan P-luku "},{"$f":"+E!D179","v":0.46325679358003691},{"$f":"+E!E179","v":0.38472821725788009},{"$f":"+E!F179","v":0.31314731630883941},{"$f":"+E!G179","v":0.25476112982336069},{"$f":"+E!H179","v":0.21016974257354773}]
[]
[]
[null,"TULKINTARAPORTTI"]
[]
[null,null,{"$f":"+C4","v":"Ennakoidut viisi vuotta:"}]
[null,null,1,2,3,4,5]
[null,"Kannattavuus"]
[null,"Käyttökate / Myyntituotot (%)",{"$f":"+IF(C84>0,\"Positiivinen\",\"Negatiivinen\")","v":"Positiivinen"},{"$f":"+IF(D84>0,\"Positiivinen\",\"Negatiivinen\")","v":"Positiivinen"},{"$f":"+IF(E84>0,\"Positiivinen\",\"Negatiivinen\")","v":"Positiivinen"},{"$f":"+IF(F84>0,\"Positiivinen\",\"Negatiivinen\")","v":"Positiivinen"},{"$f":"+IF(G84>0,\"Positiivinen\",\"Negatiivinen\")","v":"Positiivinen"}]
[null,"Sijoitetun pääoman tuotto-%",null,{"$f":"+IF(D87>15,\"Erinomainen\",IF(D87>10,\"Hyvä\",IF(D87>6,\"Tyydyttävä\",IF(D87>3,\"Välttävä\",\"Heikko\"))))","v":"Erinomainen"},{"$f":"+IF(E87>15,\"Erinomainen\",IF(E87>10,\"Hyvä\",IF(E87>6,\"Tyydyttävä\",IF(E87>3,\"Välttävä\",\"Heikko\"))))","v":"Erinomainen"},{"$f":"+IF(F87>15,\"Erinomainen\",IF(F87>10,\"Hyvä\",IF(F87>6,\"Tyydyttävä\",IF(F87>3,\"Välttävä\",\"Heikko\"))))","v":"Erinomainen"},{"$f":"+IF(G87>15,\"Erinomainen\",IF(G87>10,\"Hyvä\",IF(G87>6,\"Tyydyttävä\",IF(G87>3,\"Välttävä\",\"Heikko\"))))","v":"Erinomainen"}]
[null,"Oman pääoman tuotto-%",null,{"$f":"+IF(D88=\"\",\"\",IF(D88>20,\"Erinomainen\",IF(D88>15,\"Hyvä\",IF(D88>10,\"Tyydyttävä\",IF(D88>5,\"Välttävä\",\"Heikko\")))))","v":"Erinomainen"},{"$f":"+IF(E88=\"\",\"\",IF(E88>20,\"Erinomainen\",IF(E88>15,\"Hyvä\",IF(E88>10,\"Tyydyttävä\",IF(E88>5,\"Välttävä\",\"Heikko\")))))","v":"Erinomainen"},"Erinomainen","Erinomainen"]
[]
[null,"Maksuvalmius"]
[null,"Rahoitustulos / Myyntituotot",{"$f":"+IF(C91>0,\"Positiivinen\",\"Negatiivinen\")","v":"Positiivinen"},{"$f":"+IF(D91>0,\"Positiivinen\",\"Negatiivinen\")","v":"Positiivinen"},{"$f":"+IF(E91>0,\"Positiivinen\",\"Negatiivinen\")","v":"Positiivinen"},{"$f":"+IF(F91>0,\"Positiivinen\",\"Negatiivinen\")","v":"Positiivinen"},{"$f":"+IF(G91>0,\"Positiivinen\",\"Negatiivinen\")","v":"Positiivinen"}]
[null,"Quick ratio",{"$f":"+IF(C92>1.5,\"Erinomainen\",IF(C92>1,\"Hyvä\",IF(C92>0.5,\"Tyydyttävä\",IF(C92>0.3,\"Välttävä\",\"Heikko\"))))","v":"Hyvä"},{"$f":"+IF(D92>1.5,\"Erinomainen\",IF(D92>1,\"Hyvä\",IF(D92>0.5,\"Tyydyttävä\",IF(D92>0.3,\"Välttävä\",\"Heikko\"))))","v":"Erinomainen"},{"$f":"+IF(E92>1.5,\"Erinomainen\",IF(E92>1,\"Hyvä\",IF(E92>0.5,\"Tyydyttävä\",IF(E92>0.3,\"Välttävä\",\"Heikko\"))))","v":"Erinomainen"},{"$f":"+IF(F92>1.5,\"Erinomainen\",IF(F92>1,\"Hyvä\",IF(F92>0.5,\"Tyydyttävä\",IF(F92>0.3,\"Välttävä\",\"Heikko\"))))","v":"Erinomainen"},{"$f":"+IF(G92>1.5,\"Erinomainen\",IF(G92>1,\"Hyvä\",IF(G92>0.5,\"Tyydyttävä\",IF(G92>0.3,\"Välttävä\",\"Heikko\"))))","v":"Erinomainen"}]
[]
[null,"Vakavaraisuus"]
[null,"Omavaraisuusaste",{"$f":"+IF(C95>50,\"Erinomainen\",IF(C95>35,\"Hyvä\",IF(C95>25,\"Tyydyttävä\",IF(C95>15,\"Välttävä\",\"Heikko\"))))","v":"Tyydyttävä"},{"$f":"+IF(D95>50,\"Erinomainen\",IF(D95>35,\"Hyvä\",IF(D95>25,\"Tyydyttävä\",IF(D95>15,\"Välttävä\",\"Heikko\"))))","v":"Hyvä"},"Hyvä","Erinomainen","Erinomainen"]
[null,"Rahoitustulos / Velat (%)",{"$f":"+IF(1/(C96/100)<1,\"Erinomainen\",IF(1/(C96/100)<3,\"Hyvä\",IF(1/(C96/100)<5,\"Tyydyttävä\",IF(1/(C96/100)<10,\"Välttävä\",\"Heikko\"))))","v":"Tyydyttävä"},{"$f":"+IF(1/(D96/100)<1,\"Erinomainen\",IF(1/(D96/100)<3,\"Hyvä\",IF(1/(D96/100)<5,\"Tyydyttävä\",IF(1/(D96/100)<10,\"Välttävä\",\"Heikko\"))))","v":"Tyydyttävä"},"Hyvä","Hyvä","Hyvä"]
[]
[null,"Rahoitusriski"]
[null,"Kolmen muuttujan P-luku",{"$f":"+IF(C99>0.65,\"Erittäin suuri riski\",IF(C99>0.45,\"Suuri riski\",IF(C99>0.25,\"Kohtuullinen riski\",IF(C99>0.1,\"Suhteellisen pieni riski\",\"Pieni riski\"))))","v":"Suuri riski"},{"$f":"+IF(D99>0.65,\"Erittäin suuri riski\",IF(D99>0.45,\"Suuri riski\",IF(D99>0.25,\"Kohtuullinen riski\",IF(D99>0.1,\"Suhteellisen pieni riski\",\"Pieni riski\"))))","v":"Kohtuullinen riski"},"Kohtuullinen riski","Kohtuullinen riski","Suhteellisen pieni riski"]
[]
[]
[null,"LIITEKUVIOT"]
[null,null,null,null,null,null,null,null,null,"Vuosi",1,2,3,4,5]
[null,null,null,null,null,null,null,null,null,"Käyttökate",{"$f":"+C31","v":69210},{"$f":"+D31","v":73330.5},{"$f":"+E31","v":77676.824999999997},{"$f":"+F31","v":82260.860249999998},{"$f":"+G31","v":87095.103082499991}]
[null,null,null,null,null,null,null,null,null,"Liiketulos",{"$f":"+C39","v":47960.000000000015},{"$f":"+D39","v":55176.333333333343},{"$f":"+E39","v":62036.755555555545},{"$f":"+F39","v":68678.363722222217},{"$f":"+G39","v":75210.146736049384}]
[null,null,null,null,null,null,null,null,null,"Tilikauden tulos",{"$f":"+C42","v":34276.000000000015},{"$f":"+D42","v":40313.066666666673},{"$f":"+E42","v":46301.804444444439},{"$f":"+F42","v":52040.430977777767},{"$f":"+G42","v":57627.396388839508}]
[]
[]
[]
[]
[]
[]
[]
[]
[]
[]
[]
[]
[]
[]
[]
[]
[]
[null,null,null,null,null,null,null,null,null,"Vuosi",1,2,3,4,5]
[null,null,null,null,null,null,null,null,null,"Sijoitetun pääoman tuotto-%",null,{"$f":"+D87","v":18.718054839380866},{"$f":"+E87","v":20.637624924114796},{"$f":"+F87","v":21.785395737377751},{"$f":"+G87","v":22.280303458549991}]
[null,null,null,null,null,null,null,null,null,"Quick ratio",{"$f":"+C92","v":1.4348607140146241},{"$f":"+D92","v":2.268566241438609},{"$f":"+E92","v":3.1955290083838102},{"$f":"+F92","v":4.1568639370192626},{"$f":"+G92","v":5.1138902680271485}]
[null,null,null,null,null,null,null,null,null,"Omavaraisuusaste",{"$f":"+C95","v":25.038156603481227},35.743475290684167,46.019105494504117,55.207776814335375,63.01787335697162]
[]
[]
[]
[]
[]
[]
[]
[]
[]
[]
[]
[]
[]
[]
[]
[]
[null,null,null,null,null,null,null,null,null,"Vuosi",1,2,3,4,5]
[null,null,null,null,null,null,null,null,null,"Rahoitusriski",{"$f":"+C99","v":0.46325679358003691},{"$f":"+D99","v":0.38472821725788009},0.31314731630883941,0.25476112982336069,0.21016974257354773]
[null,null,null,null,null,null,null,null,null,"Kriittinen taso",0.5,0.5,0.5,0.5,0.5]