{"text_format":"1","workbook":"xlsx","n_sheets":3,"sheets":["K","E","T"],"not_rendered":{"charts":6,"images":0,"macros":0,"external_links":0,"defined_names":0,"comments":0,"pivot_tables":0},"unopened":[],"bounds":{"document_bytes":16777216,"sheet_cells":100000,"rows_first":2000,"rows_last":500,"rows_between":2000,"halvings":0,"cell_chars":16384,"cell_head_chars":4096},"cells_cut":0,"cells_raw":0,"read":"whole","date_system":"1900"}

{"sheet":"K","index":0,"n_rows":274,"n_cols":8,"rows_kept":274,"cut":false,"hidden":false,"merged":[[76,0,76,4],[78,0,78,4],[5,0,5,6],[71,0,71,4],[72,0,72,4],[73,0,73,4],[74,0,74,4],[75,0,75,4],[66,0,66,4],[67,0,67,4],[70,0,70,4],[58,0,58,3],[59,0,59,3],[60,0,60,3],[61,0,61,3],[46,0,46,3],[47,0,47,3],[48,0,48,3],[49,0,49,3],[65,0,65,4],[50,0,50,3],[54,0,54,3],[55,0,55,3],[56,0,56,3],[57,0,57,3],[34,0,34,4],[42,0,42,3],[43,0,43,3],[44,0,44,3],[45,0,45,3],[29,0,29,4],[30,0,30,4],[28,0,28,4],[32,0,32,4],[31,0,31,4],[273,0,273,5],[3,0,3,6],[9,0,9,4],[10,0,10,4],[11,0,11,4],[12,0,12,4],[15,0,15,4],[16,0,16,4],[17,0,17,4],[18,0,18,4],[20,0,20,4],[21,0,21,4],[22,0,22,4],[19,0,19,4],[26,0,26,4],[27,0,27,4]]}
[]
["ALOITTAVAN TÄYSIHOITO/VALMENNUSTALLIN TILINPÄÄTÖSTEN ENNAKOINTI VIIDELLE VUODELLE"]
[]
["Tällä laskentamallilla voit helposti laatia perustettavalle uudelle täysihoito- tai valmennustallille alustavan taloudellisen laskelman viiden ensimmäisen vuoden toiminnasta.  Syötä laskentaa varten malliin ensin tiedot tallille hankittavasta omaisuudesta, yrityksesi veroprosentista, otettavien velkojen korosta ja laina-ajan pituudesta, sinun voitto-osuudestasi, rahoitusomaisuuden riittävästä määrästä sekä arvioi liikevaihdon ja kiinteiden kulujen kasvuprosentit. Syötä tämän jälkeen tallisi ensimmäiselle toimintavuodelle ennakoimasi tulot ja kulut, investoinnit ja rahoitus. Tässä laskentamallissa ei oteta huomioon arvonlisäveroa."]
[]
["Taulukossa on valmiina esimerkkinä kuvitteellisen täysihoito/valmennustallin luvut. Tässä omissa tiloissa toimivassa tallissa on pelkästään täysihoidossa 10 hevosta ja täysihoito/valmennuksessa 10 hevosta. Talli rahoittaa aloittavan toimintansa lyhytaikaisella ja pitkäaikaisella velalla ja omalla pääomalla. Muuta taulukon vihreissä ruuduissa olevat tallin esimerkkiluvut oman tallisi arvioiduiksi luvuiksi. Pohdi antamiasi lukuja mahdollisimman huolellisesti."]
[]
["Syötä ensin laskelmissa käytettävät lukuarvot pitkäaikaisen omaisuuden käyttöajoille, verolle ja muille tekijöille:"]
["Pitkäaikaisen omaisuuden keskimääräinen käyttöaika:",null,null,null,null,"Käyttöaika vuosina","Poisto-osuus"]
["Miten monta vuotta arvioit hankkimiesi rakennusten ja rakennelmien (esim. maneesi, talli, harjoitusravirata, tarhat) toimivan tallin käytössä?",null,null,null,null,15,{"$f":"1/F10","v":6.6666666666666666E-2}]
["Miten monta vuotta arvioit  hankkimiesi koneiden ja kaluston (esim. traktori, lana, pienkuormaaja) toimivan talli käytössä?",null,null,null,null,4,{"$f":"1/F11","v":0.25}]
["Miten pitkäaikaiseen käyttöön hankkimasi aineeton käyttöomaisuus (esim. tietokoneohjelmat) on tarkoitettu?",null,null,null,null,5,{"$f":"1/F12","v":0.2}]
["Miten pitkäaikaiseen käyttöön hankkimasi muu käyttöomaisuus (esim. työkalut, muu irtaimisto) on tarkoitettu?",null,null,null,null,2,{"$f":"1/F13","v":0.5}]
[]
["Muut tiedot:",null,null,null,null,"Muut tiedot","%-osuus"]
["Kuinka monta prosenttia yrityksesi maksaa veroja verotettavasta tuloksesta? (esim. osakeyhtiöillä verokanta on 20 % 2021)",null,null,null,null,20,{"$f":"+F16/100","v":0.2}]
["Miten suureksi arvioit yrityksellesi mahdollisesti ottamasi lyhytaikaisen (alle vuoden mittaisen) velan vuotuisen korkoprosentin?",null,null,null,null,3,{"$f":"+F17/100","v":0.03}]
["Miten suureksi arvioit yrityksellesi mahdollisesti ottamasi pitkäaikaisen (yli vuoden mittaisen) velan vuotuisen korkoprosentin?",null,null,null,null,2,{"$f":"+F18/100","v":0.02}]
["Miten monta vuotta pitkäaikaista velkaa maksetaan takaisin? (mallissa oletetaan yhtä suuret vuosittaiset lyhennykset)",null,null,null,null,5,5]
["Miten paljon aiot nostaa yrityksestä voitto-osuutta (esim. osinkoja) prosentteina yrityksen tuottamista kertyneistä voitoista? (huomaa, että talliyrittäjän korvaus syntyy voitto-osuudesta ja myös tallille jäävästä nettovoitosta, ei palkasta)",null,null,null,null,5,{"$f":"+F20/100","v":0.05}]
["Miten paljon vähintään aiot pitää rahaa kassassa ja pankkitilillä toiminnan pyörittämistä varten prosentteina liikevaihdosta?",null,null,null,null,5,{"$f":"+F21/100","v":0.05}]
["Miten monta prosenttia arvioit yrityksesi liikevaihdon kasvavan vuosittain viiden vuoden aikana?",null,null,null,null,5,{"$f":"+F22/100","v":0.05}]
["Miten monta prosenttia arvioit yrityksesi kiinteiden kustannusten kasvavan vuosittain viiden vuoden aikana?",null,null,null,null,3,{"$f":"+F23/100","v":0.03}]
[]
["Laadi sen jälkeen arvio täysihoito/valmennustallisi ensimmäisen vuoden liikevaihdosta. "]
[]
["Minkä hintaiseksi arvioit pelkän täysihoitopaikan hinnan hevosta kohti kuukaudessa? (euroa / hevonen / kuukausi)",null,null,null,null,500,"euroa / kk",{"$f":"+IF(F27<0,\"Luvun pitää olla positiivinen\",\"\")","v":""}]
["Kuinka monta hevosta sinulla on tarkoitus ottaa pelkälle täysihoitopaikalle?",null,null,null,null,10,"hevosta",{"$f":"+IF(F28<0,\"Luvun pitää olla positiivinen\",\"\")","v":""}]
["Millaiseksi arvioit tallin käyttöasteen pelkissä täysihoitopaikoissa keskimäärin prosentteina 0 - 100 % (täysi talli)?",null,null,null,null,90,"%",{"$f":"+IF(F29<0,\"Luvun pitää olla positiivinen\",IF(F29>100,\"Luvun pitää olla alle 100\",\"\"))","v":""}]
["Minkä hintaiseksi arvioit täysihoito- ja valmennuspaikan hinnan hevosta kohti kuukaudessa? (euroa / hevonen / kuukausi)",null,null,null,null,950,"euroa / kk",{"$f":"+IF(F30<0,\"Luvun pitää olla positiivinen\",\"\")","v":""}]
["Kuinka monta hevosta sinulla on tarkoitus ottaa täysihoito/valmennuspaikalle?",null,null,null,null,10,"hevosta",{"$f":"+IF(F31<0,\"Luvun pitää olla positiivinen\",\"\")","v":""}]
["Millaiseksi arvioit tallin käyttöasteen täysihoito/valmennuspaikoissa keskimäärin prosentteina 0 - 100 % (täysi talli)?",null,null,null,null,90,"%",{"$f":"+IF(F32<0,\"Luvun pitää olla positiivinen\",IF(F32>100,\"Luvun pitää olla alle 100\",\"\"))","v":""}]
["Esittämiesi lukujen perusteella ensimmäisen vuoden liikevaihto on siten seuraava:",null,null,null,null,{"$f":"12*F27*F28*F29/100+12*F30*F31*F32/100","v":156600},"euroa"]
[]
["Täysihoito/valmennustallisi ensimmäisen vuoden ennakoitu liikevaihto on:",null,null,null,null,{"$f":"+F33","v":156600},"euroa"]
["Täysihoidossa on keskimäärin hevosia käyttöaste huomioiden:",null,null,null,null,{"$f":"+F28*F29/100","v":9},"hevosta"]
["Valmennuksessa on keskimäärin hevosia käyttäaste huomioiden:",null,null,null,null,{"$f":"+F31*F32/100","v":9},"hevosta"]
["Hevosia on tallissasi keskimäärin yhteensä käyttöaste huomioiden:",null,null,null,null,{"$f":"+F36+F37","v":18},"hevosta"]
[]
["Laadi sitten arvio yrityksen kulujen määrästä."]
[]
["Muuttuvat kulut:"]
["Millaisiksi arvioit ensimmäisen vuoden muuttuvat kulut, jotka riippuvat suoraan hevosten määrästä?",null,null,null,null,"Vuodessa:","Liikevaih-dosta, %"]
["Miten paljon kulut karkearehusta ovat hevosta kohti kuukaudessa (euroa / hevonen / kuukausi)?",null,null,null,100,{"$f":"+E44*12*$F$38","v":21600},{"$f":"100*F44/$F$35","v":13.793103448275861},{"$f":"+IF(E44<0,\"Kulujen määrä ei saa olla negatiivinen\",\"\")","v":""}]
["Miten paljon kulut väkirehusta ovat hevosta kohti kuukaudessa (euroa / hevonen / kuukausi)?",null,null,null,20,{"$f":"+E45*12*$F$38","v":4320},2.7586206896551726,{"$f":"+IF(E45<0,\"Kulujen määrä ei saa olla negatiivinen\",\"\")","v":""}]
["Miten paljon kulut kivennäisistä ovat hevosta kohti kuukaudessa (euroa / hevonen / kuukausi)?",null,null,null,40,8640,5.5172413793103452,""]
["Miten paljon muut ruokintakulut ovat hevosta kohti kuukaudessa (euroa / hevonen / kuukausi)?",null,null,null,40,8640,5.5172413793103452,""]
["Miten paljon kuivikekulut ovat hevosta kohti kuukaudessa (euroa / hevonen / kuukausi)?",null,null,null,50,10800,6.8965517241379306,""]
["Miten suuriksi arvioit täysihoidon muuttuvat palkat (esim. hoitaja) lisineen hevosta kohti kuukaudessa? (euroa / hevonen / kuukausi) (älä laita tähän talliyrittäjän palkkaa)",null,null,null,100,{"$f":"+F38*E49*12","v":21600},13.793103448275861,""]
["Miten suuriksi arvioit valmennuksen muuttuvat palkat (esim. valmentaja) lisineen hevosta kohti kuukaudessa? (euroa / hevonen / kuukausi) (älä laita tähän talliyrittäjän palkkaa)",null,null,null,300,{"$f":"+F37*E50*12","v":32400},20.689655172413794,""]
["Miten paljon muut muuttuvat kulut (esim. talikot, siivoustarvikkeet) ovat hevosta kohti vuodessa  (euroa / hevonen / vuosi)?",null,null,null,50,{"$f":"+E51*$F$38","v":900},0.57471264367816088,""]
["Ensimmäisen vuoden ennakoitu myyntikate (liikevaihto - muuttuvat kulut) on:",null,null,null,null,{"$f":"+F35-SUM(F44:F51)","v":47700},30.459770114942529]
[]
["Kiinteät kulut:",null,null,{"$f":"+IF(B54<0,\" Huom! Luvun pitää olla positiivinen tai nolla!\",\"\")","v":""}]
["Millaisiksi arvioit ensimmäisen vuoden kiinteät kulut?"]
["Kuinka paljon arvioit vuokrakuluiksi kuukaudessa käyttämistäsi tiloista? (euroa / kuukausi) (jos vuokratiloja)",null,null,null,0,{"$f":"12*E56","v":0},{"$f":"100*F56/$F$35","v":0},{"$f":"+IF(E56<0,\"Kulujen määrä ei saa olla negatiivinen\",\"\")","v":""}]
["Kuinka paljon arvioit sähkön kulutuksen kuluiksi kuukaudessa? (euroa / kuukausi) ",null,null,null,200,{"$f":"12*E57","v":2400},1.5325670498084292,""]
["Kuinka paljon arvioit veden kulutuksen kuluiksi kuukaudessa? (euroa / kuukausi) ",null,null,null,100,1200,0.76628352490421459,""]
["Kuinka paljon arvioit pohjien huollon kuluiksi kuukaudessa (maneesi, ratsastuskenttä, rata)? (euroa / kuukausi) ",null,null,null,250,3000,1.9157088122605364,""]
["Kuinka paljon arvioit lantalan tyhjennyksen kuluiksi kuukaudessa? (euroa / kuukausi) ",null,null,null,100,1200,0.76628352490421459,""]
["Kuinka suuriksi arvioit kiinteät palkkakustannukset lisineen (esim. tallityöntekijät, kirjanpitäjä) kuukaudessa? (älä laita tähän talliyrittäjän palkkaa)",null,null,null,1000,12000,7.6628352490421454,""]
["Kuinka suuriksi arvioit muut edellä mainitsemattomat kiinteät kulut kuukaudessa? (euroa / kuukausi)",null,null,null,100,1200,0.76628352490421459,""]
[]
["Ensimmäisen vuoden ennakoitu käyttökate (liikevaihto - muuttuvat kulut - kiinteät kulut) on:",null,null,null,null,{"$f":"+F52-SUM(F56:F62)","v":26700},17.049808429118773]
[]
["Esittämiesi lukujen perusteella arvioit ensimmäisen vuoden kuluiksi yhteensä:",null,null,null,null,{"$f":"+SUM(F44:F51)+SUM(F56:F62)","v":129900},82.950191570881231]
[{"$f":"+IF(F67>0,\"Liikevaihdon ja muuttuvien kulujen erotus (myyntikate) on:\",\"Muuta antamiasi tietoja, sillä liikevaihdon ja muuttuvien kulujen erotus on negatiivinen:\")","v":"Liikevaihdon ja muuttuvien kulujen erotus (myyntikate) on:"},null,null,null,null,{"$f":"+F52","v":47700},30.459770114942529]
[{"$f":"+IF(F68>0,\"Liikevaihdon ja  muuttuvien ja kiinteiden kulujen erotus (käyttökate) on:\",\"Muuta antamiasi tietoja, sillä liikevaihdon ja kulujen erotus (käyttökate) on negatiivinen:\")","v":"Liikevaihdon ja  muuttuvien ja kiinteiden kulujen erotus (käyttökate) on:"},null,null,null,null,{"$f":"+F64","v":26700},17.049808429118773]
[]
["Investoinnit (pitkäaikaiset sijoitukset) täysihoito/valmennustalliin:"]
["Miten paljon aiot investoida euroissa talliin ensimmäisenä vuonna, kun pitkäaikainen omaisuus hankitaan?"]
["Miten paljon aiot sijoittaa euroja maa- ja vesialueisiin? (esim. tontin ostamiseen)",null,null,null,null,40000,{"$f":"100*F72/$F$35","v":25.542784163473819},{"$f":"+IF(F72<0,\"Investoitu määrä ei saa olla negatiivinen\",\"\")","v":""}]
["Miten paljon aiot sijoittaa euroja rakennuksiin ja rakennelmiin?  (esim. maneesi, talli, harjoitusravirata, tarhat)",null,null,null,null,200000,127.7139208173691,""]
["Miten paljon aiot sijoittaa euroja koneisiin ja kalustoon  (esim. traktori, lana, pienkuormaaja)?",null,null,null,null,50000,31.928480204342275,""]
["Miten paljon aiot sijoittaa euroja aineettomaan käyttöomaisuuteen (esim. tietokoneohjelmat)?",null,null,null,null,1000,0.63856960408684549,""]
["Miten paljon aiot sijoittaa euroja muuhun käyttöomaisuuteen (esim. työkalut, muu irtaimisto)?",null,null,null,null,1000,0.63856960408684549,""]
["Esittämiesi lukujen perusteella sijoitat euroja yrityksesi omaisuuteen yhteensä:",null,null,null,null,{"$f":"+SUM(F72:F76)","v":292000},186.46232439335887]
[]
["Täysihoito/valmennustallisi toiminnan rahoitus:"]
["Millä tavalla aiot rahoittaa tallin ensimmäisen toimintavuoden investoinnit ja toiminnan?"]
["Miten paljon aiot ottaa lyhytaikaista velkaa toimintaa varten? (euroja)",null,null,{"$f":"+IF(C81<0,\" Huom! Luvun pitää olla positiivinen tai nolla!\",\"\")","v":""},null,20000,"euroa",{"$f":"+IF(F81<0,\"Rahoituksen määrä ei saa olla negatiivinen\",\"\")","v":""}]
["Miten paljon aiot ottaa pitkäaikaista velkaa investointien rahoittamista varten? (euroja)",null,null,{"$f":"+IF(C82<0,\" Huom! Luvun pitää olla positiivinen tai nolla!\",\"\")","v":""},null,270000,"euroa",{"$f":"+IF(F82<0,\"Rahoituksen määrä ei saa olla negatiivinen\",\"\")","v":""}]
["Miten paljon aiot sijoittaa toimintaan omaa pääomaa? (euroja)",null,null,null,null,10000,"euroa",""]
["Esittämiesi lukujen perusteella otat ensimmäisenä vuonna velkaa ja sijoitat omaa pääomaa yritykseesi yhteensä:",null,null,null,null,{"$f":"+SUM(F81:F83)","v":300000},"euroa"]
[]
["Sijoittamasi oman pääoman osuus rahoituksesta ilman toiminnan tuottamaa tulorahoitusta on:",null,null,null,null,{"$f":"100*F83/F84","v":3.3333333333333335},"%"]
["Sijoitetun oman pääoman ja pitkäaikaisen velan osuus investointien rahoituksesta on:",null,null,null,null,{"$f":"100*(F82+F83)/F77","v":95.890410958904113},"%"]
[]
[]
["MALLIN TUOTTAMAT TILINPÄÄTÖSLASKELMAT VIIDELLE VUODELLE"]
[]
[{"$f":"+T!B3","v":"ENNAKOITU TULOSLASKELMA"}]
[null,{"$f":"+T!C4","v":"Ennakoidut viisi vuotta:"}]
[null,{"$f":"+T!C5","v":1},{"$f":"+T!D5","v":2},{"$f":"+T!E5","v":3},{"$f":"+T!F5","v":4},{"$f":"+T!G5","v":5}]
[{"$f":"+T!B6","v":"Liikevaihto"},{"$f":"+T!C6","v":156600},{"$f":"+T!D6","v":164430},{"$f":"+T!E6","v":172651.5},{"$f":"+T!F6","v":181284.07500000001},{"$f":"+T!G6","v":190348.27875}]
[{"$f":"+T!B7","v":" - Muuttuvat kulut"}]
[{"$f":"+T!B8","v":"Karkearehu"},{"$f":"+T!C8","v":21600},{"$f":"+T!D8","v":22680},{"$f":"+T!E8","v":23814},{"$f":"+T!F8","v":25004.7},{"$f":"+T!G8","v":26254.934999999998}]
[{"$f":"+T!B9","v":"Väkirehu"},{"$f":"+T!C9","v":4320.0000000000009},{"$f":"+T!D9","v":4536.0000000000009},{"$f":"+T!E9","v":4762.8},{"$f":"+T!F9","v":5000.9400000000005},{"$f":"+T!G9","v":5250.9870000000001}]
[{"$f":"+T!B10","v":"Kivennäiset"},{"$f":"+T!C10","v":8640.0000000000018},{"$f":"+T!D10","v":9072.0000000000018},{"$f":"+T!E10","v":9525.6},{"$f":"+T!F10","v":10001.880000000001},{"$f":"+T!G10","v":10501.974}]
[{"$f":"+T!B11","v":"Muut ruokintakustannukset"},{"$f":"+T!C11","v":8640.0000000000018},{"$f":"+T!D11","v":9072.0000000000018},{"$f":"+T!E11","v":9525.6},{"$f":"+T!F11","v":10001.880000000001},{"$f":"+T!G11","v":10501.974}]
[{"$f":"+T!B12","v":"Kuivikekustannukset"},{"$f":"+T!C12","v":10800},{"$f":"+T!D12","v":11340},{"$f":"+T!E12","v":11907},{"$f":"+T!F12","v":12502.35},{"$f":"+T!G12","v":13127.467499999999}]
[{"$f":"+T!B13","v":"Täyshoidon muuttuvat palkat lisineen"},{"$f":"+T!C13","v":21600},{"$f":"+T!D13","v":22680},{"$f":"+T!E13","v":23814},{"$f":"+T!F13","v":25004.7},{"$f":"+T!G13","v":26254.934999999998}]
[{"$f":"+T!B14","v":"Valmennuksen muuttuvat palkat lisineen"},{"$f":"+T!C14","v":32400},{"$f":"+T!D14","v":34020},{"$f":"+T!E14","v":35721},{"$f":"+T!F14","v":37507.050000000003},{"$f":"+T!G14","v":39382.402499999997}]
[{"$f":"+T!B15","v":"Muut muuttuvat kulut"},{"$f":"+T!C15","v":900},{"$f":"+T!D15","v":945},{"$f":"+T!E15","v":992.25},{"$f":"+T!F15","v":1041.8625},{"$f":"+T!G15","v":1093.9556250000001}]
[{"$f":"+T!B16","v":" = Myyntikate"},{"$f":"+T!C16","v":47700},{"$f":"+T!D16","v":50085},{"$f":"+T!E16","v":52589.25},{"$f":"+T!F16","v":55218.712499999994},{"$f":"+T!G16","v":57979.648125000007}]
[{"$f":"+T!B17","v":" - Kiinteät kulut"}]
[{"$f":"+T!B18","v":"Vuokrakulut"},{"$f":"+T!C18","v":0},{"$f":"+T!D18","v":0},{"$f":"+T!E18","v":0},{"$f":"+T!F18","v":0},{"$f":"+T!G18","v":0}]
[{"$f":"+T!B19","v":"Sähkökulut"},{"$f":"+T!C19","v":2400},{"$f":"+T!D19","v":2472},{"$f":"+T!E19","v":2546.16},{"$f":"+T!F19","v":2622.5448000000001},{"$f":"+T!G19","v":2701.2211439999996}]
[{"$f":"+T!B20","v":"Vesikulut"},{"$f":"+T!C20","v":1200},{"$f":"+T!D20","v":1236},{"$f":"+T!E20","v":1273.08},{"$f":"+T!F20","v":1311.2724000000001},{"$f":"+T!G20","v":1350.6105719999998}]
[{"$f":"+T!B21","v":"Pohjien huolto"},{"$f":"+T!C21","v":3000},{"$f":"+T!D21","v":3090},{"$f":"+T!E21","v":3182.7},{"$f":"+T!F21","v":3278.181},{"$f":"+T!G21","v":3376.5264299999999}]
[{"$f":"+T!B22","v":"Lantalan tyhjennys"},{"$f":"+T!C22","v":1200},{"$f":"+T!D22","v":1236},{"$f":"+T!E22","v":1273.08},{"$f":"+T!F22","v":1311.2724000000001},{"$f":"+T!G22","v":1350.6105719999998}]
[{"$f":"+T!B23","v":"Kiinteät palkkakustannukset lisineen"},{"$f":"+T!C23","v":12000},{"$f":"+T!D23","v":12360},{"$f":"+T!E23","v":12730.8},{"$f":"+T!F23","v":13112.724},{"$f":"+T!G23","v":13506.10572}]
[{"$f":"+T!B25","v":" = Käyttökate"},{"$f":"+T!C25","v":26700},{"$f":"+T!D25","v":28455},{"$f":"+T!E25","v":30310.35},{"$f":"+T!F25","v":32271.445499999994},{"$f":"+T!G25","v":34343.963115000006}]
[{"$f":"+T!B26","v":" - Poistot"}]
[{"$f":"+T!B27","v":"Maa- ja vesialueet"},{"$f":"+T!C27","v":0},{"$f":"+T!D27","v":0},{"$f":"+T!E27","v":0},{"$f":"+T!F27","v":0},{"$f":"+T!G27","v":0}]
[{"$f":"+T!B28","v":"Rakennukset ja rakennelmat"},{"$f":"+T!C28","v":13333.333333333334},{"$f":"+T!D28","v":13333.333333333334},{"$f":"+T!E28","v":13333.333333333334},{"$f":"+T!F28","v":13333.333333333334},{"$f":"+T!G28","v":13333.333333333334}]
[{"$f":"+T!B29","v":"Koneet ja kalusto"},{"$f":"+T!C29","v":12500},{"$f":"+T!D29","v":12500},{"$f":"+T!E29","v":12500},{"$f":"+T!F29","v":12500},{"$f":"+T!G29","v":0}]
[{"$f":"+T!B30","v":"Aineeton käyttöomaisuus"},{"$f":"+T!C30","v":200},{"$f":"+T!D30","v":200},{"$f":"+T!E30","v":200},{"$f":"+T!F30","v":200},{"$f":"+T!G30","v":200}]
[{"$f":"+T!B31","v":"Muu käyttöomaisuus"},{"$f":"+T!C31","v":500},{"$f":"+T!D31","v":500},{"$f":"+T!E31","v":0},{"$f":"+T!F31","v":0},{"$f":"+T!G31","v":0}]
[{"$f":"+T!B32","v":" = Liiketulos"},{"$f":"+T!C32","v":166.66666666666424},{"$f":"+T!D32","v":1921.6666666666642},{"$f":"+T!E32","v":4277.0166666666628},{"$f":"+T!F32","v":6238.1121666666586},{"$f":"+T!G32","v":20810.62978166667}]
[{"$f":"+T!B33","v":" - Korkokulut"},{"$f":"+T!C33","v":6000},{"$f":"+T!D33","v":6000},{"$f":"+T!E33","v":5251.9949999999999},{"$f":"+T!F33","v":5052.5766000000003},{"$f":"+T!G33","v":4796.0726089}]
[{"$f":"+T!B34","v":" - Verot"},{"$f":"+T!C34","v":0},{"$f":"+T!D34","v":0},{"$f":"+T!E34","v":0},{"$f":"+T!F34","v":237.10711333333165},{"$f":"+T!G34","v":3202.9114345533344}]
[{"$f":"+T!B35","v":"Tilikauden tulos"},{"$f":"+T!C35","v":-5833.3333333333358},{"$f":"+T!D35","v":-4078.3333333333358},{"$f":"+T!E35","v":-974.9783333333371},{"$f":"+T!F35","v":948.42845333332662},{"$f":"+T!G35","v":12811.645738213336}]
[]
[{"$f":"+T!B37","v":"ENNAKOITU TASE"}]
[null,{"$f":"+T!C38","v":"Ennakoidut viisi vuotta:"}]
[null,{"$f":"+T!C39","v":1},{"$f":"+T!D39","v":2},{"$f":"+T!E39","v":3},{"$f":"+T!F39","v":4},{"$f":"+T!G39","v":5}]
[{"$f":"+T!B40","v":"Taseen omaisuus"}]
[{"$f":"+T!B41","v":"Lyhytaikainen:"}]
[{"$f":"+T!B42","v":"Rahoitusomaisuus"},{"$f":"+T!C42","v":28700},{"$f":"+T!D42","v":8221.5},{"$f":"+T!E42","v":8632.5750000000007},{"$f":"+T!F42","v":9064.2037500000006},{"$f":"+T!G42","v":9517.4139374999995}]
[{"$f":"+T!B43","v":"Pitkäaikainen:"}]
[{"$f":"+T!B44","v":"Maa- ja vesialueet"},{"$f":"+T!C44","v":40000},{"$f":"+T!D44","v":40000},{"$f":"+T!E44","v":40000},{"$f":"+T!F44","v":40000},{"$f":"+T!G44","v":40000}]
[{"$f":"+T!B45","v":"Rakennukset ja rakennelmat"},{"$f":"+T!C45","v":186666.66666666666},{"$f":"+T!D45","v":173333.33333333331},{"$f":"+T!E45","v":159999.99999999997},{"$f":"+T!F45","v":146666.66666666663},{"$f":"+T!G45","v":133333.33333333328}]
[{"$f":"+T!B46","v":"Koneet ja kalusto"},{"$f":"+T!C46","v":37500},{"$f":"+T!D46","v":25000},{"$f":"+T!E46","v":12500},{"$f":"+T!F46","v":0},{"$f":"+T!G46","v":0}]
[{"$f":"+T!B47","v":"Aineeton käyttöomaisuus"},{"$f":"+T!C47","v":800},{"$f":"+T!D47","v":600},{"$f":"+T!E47","v":400},{"$f":"+T!F47","v":200},{"$f":"+T!G47","v":0}]
[{"$f":"+T!B48","v":"Muu käyttöomaisuus"},{"$f":"+T!C48","v":500},{"$f":"+T!D48","v":0},{"$f":"+T!E48","v":0},{"$f":"+T!F48","v":0},{"$f":"+T!G48","v":0}]
[{"$f":"+T!B49","v":"Yhteensä"},{"$f":"+T!C49","v":294166.66666666663},{"$f":"+T!D49","v":247154.83333333331},{"$f":"+T!E49","v":221532.57499999998},{"$f":"+T!F49","v":195930.87041666661},{"$f":"+T!G49","v":182850.74727083329}]
[]
[{"$f":"+T!B51","v":"Taseen pääoma"}]
[{"$f":"+T!B52","v":"Lyhytaikainen:"}]
[{"$f":"+T!B53","v":"Lyhytaikaiset velat (maks. voitto-osuus)"},{"$f":"+T!C53","v":0},{"$f":"+T!D53","v":0},{"$f":"+T!E53","v":0},{"$f":"+T!F53","v":0},{"$f":"+T!G53","v":143.67145957733274}]
[{"$f":"+T!B54","v":"Muu lyhytaikainen vieras pääoma"},{"$f":"+T!C54","v":20000},{"$f":"+T!D54","v":31066.5},{"$f":"+T!E54","v":60419.22},{"$f":"+T!F54","v":87869.086963333335},{"$f":"+T!G54","v":115977.31807928666}]
[{"$f":"+T!B55","v":"Pitkäaikainen:"}]
[{"$f":"+T!B56","v":"Pitkäaikainen vieras pääoma"},{"$f":"+T!C56","v":270000},{"$f":"+T!D56","v":216000},{"$f":"+T!E56","v":162000},{"$f":"+T!F56","v":108000},{"$f":"+T!G56","v":54000}]
[{"$f":"+T!B57","v":"Sijoitettu oma pääoma"},{"$f":"+T!C57","v":10000},{"$f":"+T!D57","v":10000},{"$f":"+T!E57","v":10000},{"$f":"+T!F57","v":10000},{"$f":"+T!G57","v":10000}]
[{"$f":"+T!B58","v":"Kertyneet voittovarat ja muu oma pääoma"},{"$f":"+T!C58","v":-5833.3333333333358},{"$f":"+T!D58","v":-9911.6666666666715},{"$f":"+T!E58","v":-10886.645000000008},{"$f":"+T!F58","v":-9938.2165466666811},{"$f":"+T!G58","v":2729.7577319693219}]
[{"$f":"+T!B59","v":"Yhteensä"},{"$f":"+T!C59","v":294166.66666666669},{"$f":"+T!D59","v":247154.83333333331},{"$f":"+T!E59","v":221532.57499999998},{"$f":"+T!F59","v":195930.87041666664},{"$f":"+T!G59","v":182850.74727083332}]
[]
[{"$f":"+T!B61","v":"ENNAKOIDUT TUNNUSLUVUT"}]
[null,{"$f":"+T!C62","v":"Ennakoidut viisi vuotta:"}]
[null,{"$f":"+T!C63","v":1},{"$f":"+T!D63","v":2},{"$f":"+T!E63","v":3},{"$f":"+T!F63","v":4},{"$f":"+T!G63","v":5}]
[{"$f":"+T!B64","v":"Koko"}]
[{"$f":"+T!B65","v":"1. Liikevaihto (Euro)"},{"$f":"+T!C65","v":156600},{"$f":"+T!D65","v":164430},{"$f":"+T!E65","v":172651.5},{"$f":"+T!F65","v":181284.07500000001},{"$f":"+T!G65","v":190348.27875}]
[{"$f":"+T!B66","v":"2. Taseen loppusumma (Euro)"},{"$f":"+T!C66","v":294166.66666666663},{"$f":"+T!D66","v":247154.83333333331},{"$f":"+T!E66","v":221532.57499999998},{"$f":"+T!F66","v":195930.87041666661},{"$f":"+T!G66","v":182850.74727083329}]
[{"$f":"+T!B67","v":"3. Tilikauden tulos (Euro)"},{"$f":"+T!C67","v":-5833.3333333333358},{"$f":"+T!D67","v":-4078.3333333333358},{"$f":"+T!E67","v":-974.9783333333371},{"$f":"+T!F67","v":948.42845333332662},{"$f":"+T!G67","v":12811.645738213336}]
[{"$f":"+T!B68","v":"4. Voitto-osuus omistajalle (Euro)"},{"$f":"+T!C68","v":0},{"$f":"+T!D68","v":0},{"$f":"+T!E68","v":0},{"$f":"+T!F68","v":0},{"$f":"+T!G68","v":143.67145957733274}]
[]
[{"$f":"+T!B70","v":"Kasvu"}]
[{"$f":"+T!B71","v":"1. Liikevaihdon kasvu-%"},null,{"$f":"+T!D71","v":5},{"$f":"+T!E71","v":5},{"$f":"+T!F71","v":5},{"$f":"+T!G71","v":5}]
[{"$f":"+T!B72","v":"2. Taseen loppusumman kasvu-%"},null,{"$f":"+T!D72","v":-15.981359773371096},{"$f":"+T!E72","v":-10.366885400447345},{"$f":"+T!F72","v":-11.556632058889477},{"$f":"+T!G72","v":-6.6758868155983464}]
[{"$f":"+T!B73","v":"3. Tilikauden tuloksen kasvu-%"},null,{"$f":"+T!D73","v":-30.085714285714275},{"$f":"+T!E73","v":-76.093706579485001},{"$f":"+T!F73","v":-197.27687487072257},{"$f":"+T!G73","v":1250.8289099916599}]
[]
[{"$f":"+T!B75","v":"Kannattavuus"}]
[{"$f":"+T!B76","v":"1. Käyttökate / Liikevaihto (%)"},{"$f":"+T!C76","v":17.049808429118773},{"$f":"+T!D76","v":17.305236270753511},{"$f":"+T!E76","v":17.555798820166636},{"$f":"+T!F76","v":17.801588749590934},{"$f":"+T!G76","v":18.04269696607383}]
[{"$f":"+T!B77","v":"2. Liiketulos / Liikevaihto (%)"},{"$f":"+T!C77","v":0.10642826734780603},{"$f":"+T!D77","v":1.1686837357335427},{"$f":"+T!E77","v":2.477254276196073},{"$f":"+T!F77","v":3.4410701362856382},{"$f":"+T!G77","v":10.932922492563737}]
[{"$f":"+T!B78","v":"3. Tilikauden tulos / Liikevaihto (%)"},{"$f":"+T!C78","v":-3.7249893571732668},{"$f":"+T!D78","v":-2.4802854304770032},{"$f":"+T!E78","v":-0.56470886921534835},{"$f":"+T!F78","v":0.52317251437189205},{"$f":"+T!G78","v":6.7306338793007523}]
[{"$f":"+T!B79","v":"4. Sijoitetun pääoman tuotto-%"},null,{"$f":"+T!D79","v":0.65325779036827125},{"$f":"+T!E79","v":1.7305009208127955},{"$f":"+T!F79","v":2.8158893411800316},{"$f":"+T!G79","v":10.621414449601934}]
[{"$f":"+T!B80","v":"5. Oman pääoman tuotto-%"},null,{"$f":"+T!D80","v":-97.880000000000123},{"$f":"+T!E80","v":-1103.7490566038384},{"$f":"+T!F80","v":""},{"$f":"+T!G80","v":20736.370414737248}]
[]
[{"$f":"+T!B82","v":"Maksuvalmius"}]
[{"$f":"+T!B83","v":"1. Rahoitustulos / Liikevaihto"},{"$f":"+T!C83","v":13.218390804597702},{"$f":"+T!D83","v":13.656267104542966},{"$f":"+T!E83","v":14.513835674755216},{"$f":"+T!F83","v":14.883691127677189},{"$f":"+T!G83","v":13.840408352810845}]
[{"$f":"+T!B84","v":"2. Quick ratio"},{"$f":"+T!C84","v":1.4350000000000001},{"$f":"+T!D84","v":0.2646419776930134},{"$f":"+T!E84","v":0.14287796168172975},{"$f":"+T!F84","v":0.1031557748378833},{"$f":"+T!G84","v":8.1961185271459125E-2}]
[]
[{"$f":"+T!B86","v":"Vakavaraisuus"}]
[{"$f":"+T!B87","v":"1. Omavaraisuusaste"},{"$f":"+T!C87","v":1.4164305949008489},{"$f":"+T!D87","v":3.5740079262053068E-2},{"$f":"+T!E87","v":-0.40023233603455732},{"$f":"+T!F87","v":3.1533291921752908E-2},{"$f":"+T!G87","v":6.9618297556719133}]
[{"$f":"+T!B88","v":"2. Rahoitustulos / Velat (%)"},{"$f":"+T!C88","v":7.1379310344827589},{"$f":"+T!D88","v":9.0886461742081579},{"$f":"+T!E88","v":11.266272312257906},{"$f":"+T!F88","v":13.775405912683732},{"$f":"+T!G88","v":15.48602505955221}]
[]
[{"$f":"+T!B90","v":"Rahoitusriski: Taipumus kuulua konkurssiyritysten (1) tai toimivien yritysten (0) joukkoon"}]
[{"$f":"+T!B91","v":"1. Kolmen muuttujan P-luku "},{"$f":"+T!C91","v":0.64944657698332053},{"$f":"+T!D91","v":0.66711187983454112},{"$f":"+T!E91","v":0.66887376563531686},{"$f":"+T!F91","v":0.66580865685279456},{"$f":"+T!G91","v":0.62561020797285638}]
[]
[]
[{"$f":"+T!B94","v":"TULKINTARAPORTTI"}]
[]
[null,{"$f":"+T!C96","v":"Ennakoidut viisi vuotta:"}]
[null,{"$f":"+T!C97","v":1},{"$f":"+T!D97","v":2},{"$f":"+T!E97","v":3},{"$f":"+T!F97","v":4},{"$f":"+T!G97","v":5}]
[{"$f":"+T!B98","v":"Kannattavuus"}]
[{"$f":"+T!B99","v":"Käyttökate / Myyntituotot (%)"},{"$f":"+T!C99","v":"Positiivinen"},{"$f":"+T!D99","v":"Positiivinen"},{"$f":"+T!E99","v":"Positiivinen"},{"$f":"+T!F99","v":"Positiivinen"},{"$f":"+T!G99","v":"Positiivinen"}]
[{"$f":"+T!B100","v":"Sijoitetun pääoman tuotto-%"},null,{"$f":"+T!D100","v":"Heikko"},{"$f":"+T!E100","v":"Heikko"},{"$f":"+T!F100","v":"Heikko"},{"$f":"+T!G100","v":"Hyvä"}]
[{"$f":"+T!B101","v":"Oman pääoman tuotto-%"},null,{"$f":"+T!D101","v":"Heikko"},{"$f":"+T!E101","v":"Heikko"},{"$f":"+T!F101","v":""},{"$f":"+T!G101","v":"Erinomainen"}]
[]
[{"$f":"+T!B103","v":"Maksuvalmius"}]
[{"$f":"+T!B104","v":"Rahoitustulos / Myyntituotot"},{"$f":"+T!C104","v":"Positiivinen"},{"$f":"+T!D104","v":"Positiivinen"},{"$f":"+T!E104","v":"Positiivinen"},{"$f":"+T!F104","v":"Positiivinen"},{"$f":"+T!G104","v":"Positiivinen"}]
[{"$f":"+T!B105","v":"Quick ratio"},{"$f":"+T!C105","v":"Hyvä"},{"$f":"+T!D105","v":"Heikko"},{"$f":"+T!E105","v":"Heikko"},{"$f":"+T!F105","v":"Heikko"},{"$f":"+T!G105","v":"Heikko"}]
[]
[{"$f":"+T!B107","v":"Vakavaraisuus"}]
[{"$f":"+T!B108","v":"Omavaraisuusaste"},{"$f":"+T!C108","v":"Heikko"},{"$f":"+T!D108","v":"Heikko"},{"$f":"+T!E108","v":"Heikko"},{"$f":"+T!F108","v":"Heikko"},{"$f":"+T!G108","v":"Heikko"}]
[{"$f":"+T!B109","v":"Rahoitustulos / Velat (%)"},{"$f":"+T!C109","v":"Heikko"},{"$f":"+T!D109","v":"Heikko"},{"$f":"+T!E109","v":"Välttävä"},{"$f":"+T!F109","v":"Välttävä"},{"$f":"+T!G109","v":"Välttävä"}]
[]
[{"$f":"+T!B111","v":"Rahoitusriski"}]
[{"$f":"+T!B112","v":"Kolmen muuttujan P-luku"},{"$f":"+T!C112","v":"Suuri riski"},{"$f":"+T!D112","v":"Erittäin suuri riski"},{"$f":"+T!E112","v":"Erittäin suuri riski"},{"$f":"+T!F112","v":"Erittäin suuri riski"},{"$f":"+T!G112","v":"Suuri riski"}]
[]
[{"$f":"+T!B115","v":"LIITEKUVIOT"}]
[]
[]
[]
[]
[]
[]
[]
[]
[]
[]
[]
[]
[]
[]
[]
[]
[]
[]
[]
[]
[]
[]
[]
[]
[]
[]
[]
[]
[]
[]
[]
[]
[]
[]
[]
[]
[]
[]
[]
[]
[]
[]
[]
[]
[]
[]
[]
[]
[]
[]
[]
[]
[]
[]
[]
[]
[]
[]
[]
[]
[]
[]
[]
[]
[]
[]
[]
[]
[]
[]
[]
["Tämä raportti on suuntaa-antava laskelma siitä, miten täysihoito/valmennustallisi voisi antamillasi lähtötiedoilla menestyä viiden ensimmäisen vuoden aikana. Tehdyt laskelmat perustuvat omiin arvioihisi esimerkiksi yrityksesi kasvusta ja velkojen korkokannoista. Laskelmissa ei ole huomioitu erikseen arvonlisäveroa. Vastuu laskelmien hyödyntämisestä on ohjelman käyttäjällä. Copyright Vaasan Yritysinformaatio Oy."]

{"sheet":"E","index":1,"n_rows":168,"n_cols":8,"rows_kept":168,"cut":false,"hidden":true,"merged":[]}
[1,{"$f":"+A1+1","v":2},{"$f":"+B1+1","v":3},4,5,6,7,8]
[" Copyright Vaasan Yritysinformaatio Oy. Kaikki tekijänoikeudet pidätetään."]
["PERUSTETTAVAN TÄYSHOITO/RAVITALLIYRITYKSEN TILINPÄÄTÖSENNUSTE VIIDELLE VUODELLE"]
[]
["LIIKEVAIHDON KASVUENNUSTE"]
[null,"Lähtöoletus:",null,"Vuodet:"]
[null,null,null,1,2,3,4,5]
["Ensimmäisen vuoden liikevaihto",{"$f":"+K!F35","v":156600},null,{"$f":"+$B$8*(1+$B$9)^(D$7-1)","v":156600},{"$f":"+$B$8*(1+$B$9)^(E$7-1)","v":164430},172651.5,181284.07500000001,190348.27875]
["Liikevaihdon arvioitu kasvuvauhti",{"$f":"+K!G22","v":0.05}]
["Kiinteiden kulujen arvioitu kasvuvauhti",{"$f":"+K!G23","v":0.03}]
[]
[]
["Verokanta",{"$f":"+K!G16","v":0.2}]
["Lyhytaikaisen vieraan pääoman korko-%",{"$f":"+K!G17","v":0.03}]
["Pitkäaikaisen vieraan pääoman korko-%",{"$f":"+K!G18","v":0.02}]
["Osinko-%  kertyneistä voitoista",{"$f":"+K!G20","v":0.05}]
["Pitkäaikaisen velan pituus vuosina",{"$f":"+K!G19","v":5}]
["Rahoitusomaisuus / Liikevaihto",{"$f":"+K!G21","v":0.05},"Minimitaso","Toimivien yritysten keskiarvo"]
["Vaihto-omaisuus / Liikevaihto",0,"Taso"]
["Myyntisaamisten kasvu-%",0]
["Ostovelkojen kasvu-%",0]
[]
["KASSAVIRTAENNUSTE (Euro)"]
[]
[null,null,null,{"$f":"+D7","v":1},{"$f":"+D25+1","v":2},{"$f":"+E25+1","v":3},4,5]
["Liikevaihto","%-osuus",null,{"$f":"+D8","v":156600},{"$f":"+E8","v":164430},{"$f":"+F8","v":172651.5},{"$f":"+G8","v":181284.07500000001},{"$f":"+H8","v":190348.27875}]
[" - Muuttuvat kulut"]
["Karkearehu",{"$f":"+K!G44/100","v":0.13793103448275862},null,{"$f":"+$B28*D$26","v":21600},22680,23814,25004.7,26254.934999999998]
["Väkirehu",{"$f":"+K!G45/100","v":2.7586206896551727E-2},null,4320.0000000000009,4536.0000000000009,4762.8,5000.9400000000005,5250.9870000000001]
["Kivennäiset",{"$f":"+K!G46/100","v":5.5172413793103454E-2},null,8640.0000000000018,9072.0000000000018,9525.6,10001.880000000001,10501.974]
["Muut ruokintakustannukset",{"$f":"+K!G47/100","v":5.5172413793103454E-2},null,8640.0000000000018,9072.0000000000018,9525.6,10001.880000000001,10501.974]
["Kuivikekustannukset",{"$f":"+K!G48/100","v":6.8965517241379309E-2},null,10800,11340,11907,12502.35,13127.467499999999]
["Täyshoidon muuttuvat palkat lisineen",{"$f":"+K!G49/100","v":0.13793103448275862},null,21600,22680,23814,25004.7,26254.934999999998]
["Valmennuksen muuttuvat palkat lisineen",{"$f":"+K!G50/100","v":0.20689655172413793},null,32400,34020,35721,37507.050000000003,39382.402499999997]
["Muut muuttuvat kulut",{"$f":"+K!G51/100","v":5.7471264367816091E-3},null,900,945,992.25,1041.8625,1093.9556250000001]
[" = Myyntikate (menopohjainen)",{"$f":"+K!G52/100","v":0.3045977011494253},null,{"$f":"+D26-SUM(D28:D35)","v":47700},{"$f":"+E26-SUM(E28:E35)","v":50085},{"$f":"+F26-SUM(F28:F35)","v":52589.25},{"$f":"+G26-SUM(G28:G35)","v":55218.712499999994},{"$f":"+H26-SUM(H28:H35)","v":57979.648125000007}]
[" - Kiinteät kulut"]
["Vuokrakulut",{"$f":"+K!F56","v":0},null,{"$f":"+$B38*(1+$B$10)^(D$25-1)","v":0},0,0,0,0]
["Sähkökulut",{"$f":"+K!F57","v":2400},null,2400,2472,2546.16,2622.5448000000001,2701.2211439999996]
["Vesikulut",{"$f":"+K!F58","v":1200},null,1200,1236,1273.08,1311.2724000000001,1350.6105719999998]
["Pohjien huolto",{"$f":"+K!F59","v":3000},null,3000,3090,3182.7,3278.181,3376.5264299999999]
["Lantalan tyhjennys",{"$f":"+K!F60","v":1200},null,1200,1236,1273.08,1311.2724000000001,1350.6105719999998]
["Kiinteät palkkakustannukset lisineen",{"$f":"+K!F61","v":12000},null,12000,12360,12730.8,13112.724,13506.10572]
["Muut kiinteät kulut",{"$f":"+K!F62","v":1200},null,1200,1236,1273.08,1311.2724000000001,1350.6105719999998]
[" = Käyttökate (menopohjainen)",null,null,{"$f":"+D36-SUM(D38:D44)","v":26700},{"$f":"+E36-SUM(E38:E44)","v":28455},30310.35,32271.445499999994,34343.963115000006]
["Korkomenot","automaatti",null,{"$f":"+$B$14*C$125+$B$15*C$127","v":6000},{"$f":"+$B$14*D$125+$B$15*D$127","v":6000},{"$f":"+$B$14*E$125+$B$15*E$127","v":5251.9949999999999},{"$f":"+$B$14*F$125+$B$15*F$127","v":5052.5766000000003},{"$f":"+$B$14*G$125+$B$15*G$127","v":4796.0726089}]
["Verot","automaatti",null,{"$f":"+D106","v":0},{"$f":"+E106","v":0},{"$f":"+F106","v":0},{"$f":"+G106","v":237.10711333333165},{"$f":"+H106","v":3202.9114345533344}]
["Osingot","automaatti",null,0,{"$f":"+D133","v":0},{"$f":"+E133","v":0},{"$f":"+F133","v":0},{"$f":"+G133","v":0}]
[" = Rahoitustulos (menopohjainen)",null,null,{"$f":"+D45-SUM(D46:D48)","v":20700},{"$f":"+E45-SUM(E46:E48)","v":22455},25058.355,26981.761786666662,26344.979071546673]
[" - Investoinnit"]
["Maa- ja vesialueet",{"$f":"+K!F72","v":40000},{"$f":"+B51","v":40000},{"$f":"+B51","v":40000},0,0,0,0]
["Rakennukset ja rakennelmat",{"$f":"+K!F73","v":200000},200000,200000,0,0,0,0]
["Koneet ja kalusto",{"$f":"+K!F74","v":50000},50000,50000,0,0,0,0]
["Aineeton käyttöomaisuus",{"$f":"+K!F75","v":1000},1000,1000,0,0,0,0]
["Muu käyttöomaisuus",{"$f":"+K!F76","v":1000},1000,1000,0,0,0,0]
[" - Kassavirtamuunnos"]
[" = Investointijäämä",null,null,{"$f":"+D49-SUM(D51:D56)","v":-271300},{"$f":"+E49-SUM(E51:E56)","v":22455},{"$f":"+F49-SUM(F51:F56)","v":25058.355},{"$f":"+G49-SUM(G51:G56)","v":26981.761786666662},{"$f":"+H49-SUM(H51:H56)","v":26344.979071546673}]
[" + Muun rahoitusomaisuuden vähennys","automaatti",null,{"$f":"-$B$18*D$78+C113","v":-7830},{"$f":"-$B$18*E$78+D113","v":20478.5},{"$f":"-$B$18*F$78+E113","v":-411.07500000000073},{"$f":"-$B$18*G$78+F113","v":-431.62874999999985},{"$f":"-$B$18*H$78+G113","v":-453.21018749999894}]
[" + Muun lyhytaikaisen vieraan pääoman lisäys",{"$f":"+K!F81","v":20000},null,{"$f":"+K!F81","v":20000},0,0,0,0]
[" + Pitkäaikaisen vieraan pääoman lisäys",{"$f":"+K!F82","v":270000},null,{"$f":"+K!F82","v":270000},{"$f":"-IF(K!$G$23<E25,$D$60/K!$G$19)","v":-54000},{"$f":"-IF(K!$G$23<F25,$D$60/K!$G$19)","v":-54000},{"$f":"-IF(K!$G$23<G25,$D$60/K!$G$19)","v":-54000},{"$f":"-IF(K!$G$23<H25,$D$60/K!$G$19)","v":-54000}]
[" + Oman pääoman lisäys",{"$f":"+K!F83","v":10000},null,{"$f":"+K!F83","v":10000},0,0,0,0]
[" - Rahoitusomaisuuden lisäys (tasoitus)","automaatti",null,{"$f":"+IF(SUM(D57:D61)>0,-SUM(D57:D61),0)","v":-20870},{"$f":"+IF(SUM(E57:E61)>0,-SUM(E57:E61),0)","v":0},0,0,0]
[" = Netto rahoituksen jälkeen (0)",null,null,{"$f":"+SUM(D57:D62)","v":0},{"$f":"+SUM(E57:E62)","v":-11066.5},{"$f":"+SUM(F57:F62)","v":-29352.720000000001},{"$f":"+SUM(G57:G62)","v":-27449.866963333337},{"$f":"+SUM(H57:H62)","v":-28108.231115953327}]
[null,null,null,{"$f":"+IF(D63=0,\" \",\"Huom! Ei 0\")","v":" "},{"$f":"+IF(E63=0,\" \",\"Huom! Ei 0\")","v":"Huom! Ei 0"},"Huom! Ei 0","Huom! Ei 0","Huom! Ei 0"]
[null,null,null,"Lyhytaikaisen velan"]
[null,null,null,"lisäykseen"]
[]
["Poistot:","Pitoaika","Poisto-osuus"]
[{"$f":"+A51","v":"Maa- ja vesialueet"},0,0]
[{"$f":"+A52","v":"Rakennukset ja rakennelmat"},{"$f":"+K!F10","v":15},{"$f":"+K!G10","v":6.6666666666666666E-2}]
[{"$f":"+A53","v":"Koneet ja kalusto"},{"$f":"+K!F11","v":4},{"$f":"+K!G11","v":0.25}]
[{"$f":"+A54","v":"Aineeton käyttöomaisuus"},{"$f":"+K!F12","v":5},{"$f":"+K!G12","v":0.2}]
[{"$f":"+A55","v":"Muu käyttöomaisuus"},{"$f":"+K!F13","v":2},{"$f":"+K!G13","v":0.5}]
[]
["TULOSLASKELMAENNUSTE (Euro)"]
[null,null,null,"Ennusteet:"]
[null,null,null,{"$f":"+D25","v":1},2,3,4,5]
["Liikevaihto",null,null,156600,164430,172651.5,181284.07500000001,190348.27875]
[" - Muuttuvat kulut"]
["Karkearehu",null,null,{"$f":"+D28","v":21600},22680,23814,25004.7,26254.934999999998]
["Väkirehu",null,null,4320.0000000000009,4536.0000000000009,4762.8,5000.9400000000005,5250.9870000000001]
["Kivennäiset",null,null,8640.0000000000018,9072.0000000000018,9525.6,10001.880000000001,10501.974]
["Muut ruokintakustannukset",null,null,8640.0000000000018,9072.0000000000018,9525.6,10001.880000000001,10501.974]
["Kuivikekustannukset",null,null,10800,11340,11907,12502.35,13127.467499999999]
["Täyshoidon muuttuvat palkat lisineen",null,null,21600,22680,23814,25004.7,26254.934999999998]
["Valmennuksen muuttuvat palkat lisineen",null,null,{"$f":"+D34","v":32400},34020,35721,37507.050000000003,39382.402499999997]
["Muut muuttuvat kulut",null,null,{"$f":"+D35","v":900},{"$f":"+E35","v":945},{"$f":"+F35","v":992.25},{"$f":"+G35","v":1041.8625},{"$f":"+H35","v":1093.9556250000001}]
[" = Myyntikate",null,null,{"$f":"+D78-SUM(D80:D87)","v":47700},{"$f":"+E78-SUM(E80:E87)","v":50085},{"$f":"+F78-SUM(F80:F87)","v":52589.25},{"$f":"+G78-SUM(G80:G87)","v":55218.712499999994},{"$f":"+H78-SUM(H80:H87)","v":57979.648125000007}]
[" - Kiinteät kulut"]
["Vuokrakulut",null,null,{"$f":"+D38","v":0},0,0,0,0]
["Sähkökulut",null,null,2400,2472,2546.16,2622.5448000000001,2701.2211439999996]
["Vesikulut",null,null,1200,1236,1273.08,1311.2724000000001,1350.6105719999998]
["Pohjien huolto",null,null,3000,3090,3182.7,3278.181,3376.5264299999999]
["Lantalan tyhjennys",null,null,1200,1236,1273.08,1311.2724000000001,1350.6105719999998]
["Kiinteät palkkakustannukset lisineen",null,null,12000,12360,12730.8,13112.724,13506.10572]
["Muut kiinteät kulut",null,null,1200,1236,1273.08,1311.2724000000001,1350.6105719999998]
[" = Käyttökate",null,null,{"$f":"+D88-SUM(D90:D96)","v":26700},{"$f":"+E88-SUM(E90:E96)","v":28455},30310.35,32271.445499999994,34343.963115000006]
[" - Poistot"]
[{"$f":"+A51","v":"Maa- ja vesialueet"},null,{"$f":"+C51","v":40000},{"$f":"+IF(D$77>$B69,0,$C69*$C99)","v":0},0,0,0,0]
[{"$f":"+A52","v":"Rakennukset ja rakennelmat"},null,{"$f":"+C52","v":200000},13333.333333333334,13333.333333333334,13333.333333333334,13333.333333333334,13333.333333333334]
[{"$f":"+A53","v":"Koneet ja kalusto"},null,{"$f":"+C53","v":50000},12500,12500,12500,12500,0]
[{"$f":"+A54","v":"Aineeton käyttöomaisuus"},null,{"$f":"+C54","v":1000},200,200,200,200,200]
[{"$f":"+A55","v":"Muu käyttöomaisuus"},null,{"$f":"+C55","v":1000},500,500,0,0,0]
[" = Liiketulos",null,null,{"$f":"+D97-SUM(D99:D103)","v":166.66666666666424},{"$f":"+E97-SUM(E99:E103)","v":1921.6666666666642},{"$f":"+F97-SUM(F99:F103)","v":4277.0166666666628},{"$f":"+G97-SUM(G99:G103)","v":6238.1121666666586},{"$f":"+H97-SUM(H99:H103)","v":20810.62978166667}]
[" - Korkokulut",null,null,{"$f":"+D46","v":6000},{"$f":"+E46","v":6000},{"$f":"+F46","v":5251.9949999999999},{"$f":"+G46","v":5052.5766000000003},{"$f":"+H46","v":4796.0726089}]
[" - Verot",null,null,{"$f":"+IF((D104-D105)>0,$B$13*(D104-D105),0)","v":0},{"$f":"+IF((E104-E105)>0,$B$13*(E104-E105),0)","v":0},0,237.10711333333165,3202.9114345533344]
["Tilikauden tulos",null,null,{"$f":"+D104-SUM(D105:D106)","v":-5833.3333333333358},{"$f":"+E104-SUM(E105:E106)","v":-4078.3333333333358},-974.9783333333371,948.42845333332662,12811.645738213336]
[]
["TASE-ENNUSTE (Euro)"]
[]
["Taseen omaisuus",null,null,"Ennusteet:"]
["Lyhytaikainen:",null,null,{"$f":"+D77","v":1},{"$f":"+E77","v":2},{"$f":"+F77","v":3},{"$f":"+G77","v":4},{"$f":"+H77","v":5}]
["Rahoitusomaisuus",null,null,{"$f":"+$B$18*D78-D62","v":28700},{"$f":"+$B$18*E78-E62","v":8221.5},{"$f":"+$B$18*F78-F62","v":8632.5750000000007},{"$f":"+$B$18*G78-G62","v":9064.2037500000006},{"$f":"+$B$18*H78-H62","v":9517.4139374999995}]
["Pitkäaikainen:"]
[{"$f":"+A51","v":"Maa- ja vesialueet"},null,{"$f":"+C51","v":40000},{"$f":"+C115-D99","v":40000},{"$f":"+D115-E99+E51","v":40000},40000,40000,40000]
[{"$f":"+A52","v":"Rakennukset ja rakennelmat"},null,{"$f":"+C52","v":200000},{"$f":"+C116-D100","v":186666.66666666666},173333.33333333331,159999.99999999997,146666.66666666663,133333.33333333328]
[{"$f":"+A53","v":"Koneet ja kalusto"},null,{"$f":"+C53","v":50000},{"$f":"+C117-D101","v":37500},25000,12500,0,0]
[{"$f":"+A54","v":"Aineeton käyttöomaisuus"},null,{"$f":"+C54","v":1000},{"$f":"+C118-D102","v":800},600,400,200,0]
[{"$f":"+A55","v":"Muu käyttöomaisuus"},null,{"$f":"+C55","v":1000},{"$f":"+C119-D103","v":500},0,0,0,0]
["Yhteensä",null,null,{"$f":"+D113+SUM(D115:D119)","v":294166.66666666663},{"$f":"+E113+SUM(E115:E119)","v":247154.83333333331},{"$f":"+F113+SUM(F115:F119)","v":221532.57499999998},{"$f":"+G113+SUM(G115:G119)","v":195930.87041666661},{"$f":"+H113+SUM(H115:H119)","v":182850.74727083329}]
[]
["Taseen pääoma"]
["Lyhytaikainen:"]
["Lyhytaikaiset velat (maks. voitto-osuus)",null,null,{"$f":"+D133","v":0},{"$f":"+E133","v":0},0,0,143.67145957733274]
["Muu lyhytaikainen vieras pääoma",null,{"$f":"+B59","v":20000},{"$f":"+C125-D63","v":20000},{"$f":"+D125-E63","v":31066.5},{"$f":"+E125-F63","v":60419.22},{"$f":"+F125-G63","v":87869.086963333335},{"$f":"+G125-H63","v":115977.31807928666}]
["Pitkäaikainen:"]
["Pitkäaikainen vieras pääoma",null,{"$f":"+B60","v":270000},{"$f":"+C127","v":270000},{"$f":"+D127+E60","v":216000},162000,108000,54000]
["Sijoitettu oma pääoma",null,{"$f":"+B61","v":10000},{"$f":"+C128","v":10000},10000,10000,10000,10000]
["Kertyneet voittovarat ja muu oma pääoma",null,{"$f":"+D107","v":-5833.3333333333358},{"$f":"+C129-D133","v":-5833.3333333333358},{"$f":"+D129+E107-E133","v":-9911.6666666666715},{"$f":"+E129+F107-F133","v":-10886.645000000008},{"$f":"+F129+G107-G133","v":-9938.2165466666811},{"$f":"+G129+H107-H133","v":2729.7577319693219}]
["Yhteensä",null,null,{"$f":"+SUM(D124:D129)","v":294166.66666666669},247154.83333333331,221532.57499999998,195930.87041666664,182850.74727083332]
[]
["Lisätietoja:",null,null,"Laskettu:"]
["Osingot kertyneistä voitoista",{"$f":"+B16","v":0.05},null,{"$f":"+IF(C129-$B133*C129>0,$B133*C129,IF(C129>0,C129,0))","v":0},{"$f":"+IF(D129-$B133*D129+E107>0,$B133*(D129+E107),IF(D129+E107>0,D129+E107,0))","v":0},{"$f":"+IF(E129-$B133*E129+F107>0,$B133*(E129+F107),IF(E129+F107>0,E129+F107,0))","v":0},{"$f":"+IF(F129-$B133*F129+G107>0,$B133*(F129+G107),IF(F129+G107>0,F129+G107,0))","v":0},{"$f":"+IF(G129-$B133*G129+H107>0,$B133*(G129+H107),IF(G129+H107>0,G129+H107,0))","v":143.67145957733274}]
[]
[null,null,"Tarkistus",{"$f":"0.05*(D129+D124)","v":-291.6666666666668},{"$f":"0.05*(E129+E124)","v":-495.5833333333336},-544.33225000000039,-496.91082733333405,143.67145957733274]
[]
[]
["TILINPÄÄTÖKSEN TUNNUSLUVUT"]
[null,null,null,{"$f":"+D25","v":1},{"$f":"+E25","v":2},{"$f":"+F25","v":3},{"$f":"+G25","v":4},{"$f":"+H25","v":5}]
["Koko"]
["1. Liikevaihto (Euro)",null,null,{"$f":"+D78","v":156600},{"$f":"+E78","v":164430},{"$f":"+F78","v":172651.5},{"$f":"+G78","v":181284.07500000001},{"$f":"+H78","v":190348.27875}]
["2. Taseen loppusumma (Euro)",null,null,{"$f":"+D120","v":294166.66666666663},{"$f":"+E120","v":247154.83333333331},{"$f":"+F120","v":221532.57499999998},{"$f":"+G120","v":195930.87041666661},{"$f":"+H120","v":182850.74727083329}]
["3. Tilikauden tulos (Euro)",null,null,{"$f":"+D107","v":-5833.3333333333358},{"$f":"+E107","v":-4078.3333333333358},{"$f":"+F107","v":-974.9783333333371},{"$f":"+G107","v":948.42845333332662},{"$f":"+H107","v":12811.645738213336}]
["4. Voitto-osuus omistajalle (Euro)",null,null,{"$f":"+D133","v":0},{"$f":"+E133","v":0},0,0,143.67145957733274]
[]
["Kasvu"]
["1. Liikevaihdon kasvu-%",null,null,null,{"$f":"100*E78/D78-100","v":5},{"$f":"100*F78/E78-100","v":5},{"$f":"100*G78/F78-100","v":5},{"$f":"100*H78/G78-100","v":5}]
["2. Taseen loppusumman kasvu-%",null,null,null,{"$f":"100*E120/D120-100","v":-15.981359773371096},{"$f":"100*F120/E120-100","v":-10.366885400447345},{"$f":"100*G120/F120-100","v":-11.556632058889477},{"$f":"100*H120/G120-100","v":-6.6758868155983464}]
["3. Tilikauden tuloksen kasvu-%",null,null,null,{"$f":"100*(E107)/(D107)-100","v":-30.085714285714275},{"$f":"100*(F107)/(E107)-100","v":-76.093706579485001},{"$f":"100*(G107)/(F107)-100","v":-197.27687487072257},{"$f":"100*(H107)/(G107)-100","v":1250.8289099916599}]
[]
["Kannattavuus"]
["1. Käyttökate / Liikevaihto (%)",null,null,{"$f":"100*D97/D78","v":17.049808429118773},{"$f":"100*E97/E78","v":17.305236270753511},{"$f":"100*F97/F78","v":17.555798820166636},{"$f":"100*G97/G78","v":17.801588749590934},{"$f":"100*H97/H78","v":18.04269696607383}]
["2. Liiketulos / Liikevaihto (%)",null,null,{"$f":"100*D104/D78","v":0.10642826734780603},{"$f":"100*E104/E78","v":1.1686837357335427},{"$f":"100*F104/F78","v":2.477254276196073},{"$f":"100*G104/G78","v":3.4410701362856382},{"$f":"100*H104/H78","v":10.932922492563737}]
["3. Tilikauden tulos / Liikevaihto (%)",null,null,{"$f":"100*D107/D78","v":-3.7249893571732668},{"$f":"100*E107/E78","v":-2.4802854304770032},{"$f":"100*F107/F78","v":-0.56470886921534835},{"$f":"100*G107/G78","v":0.52317251437189205},{"$f":"100*H107/H78","v":6.7306338793007523}]
["4. Sijoitetun pääoman tuotto-%",null,null,null,{"$f":"100*(E107+E106+E105)/D120","v":0.65325779036827125},{"$f":"100*(F107+F106+F105)/E120","v":1.7305009208127955},{"$f":"100*(G107+G106+G105)/F120","v":2.8158893411800316},{"$f":"100*(H107+H106+H105)/G120","v":10.621414449601934}]
["5. Oman pääoman tuotto-%",null,null,null,{"$f":"+IF(D128+D129>0,100*(E107)/(D128+D129),\"\")","v":-97.880000000000123},{"$f":"+IF(E128+E129>0,100*(F107)/(E128+E129),\"\")","v":-1103.7490566038384},"",20736.370414737248]
[]
["Maksuvalmius"]
["1. Rahoitustulos / Liikevaihto",null,null,{"$f":"100*(D107+SUM(D99:D103))/D78","v":13.218390804597702},{"$f":"100*(E107+SUM(E99:E103))/E78","v":13.656267104542966},{"$f":"100*(F107+SUM(F99:F103))/F78","v":14.513835674755216},{"$f":"100*(G107+SUM(G99:G103))/G78","v":14.883691127677189},{"$f":"100*(H107+SUM(H99:H103))/H78","v":13.840408352810845}]
["2. Quick ratio",null,null,{"$f":"+(D113)/(D124+D125)","v":1.4350000000000001},{"$f":"+(E113)/(E124+E125)","v":0.2646419776930134},{"$f":"+(F113)/(F124+F125)","v":0.14287796168172975},{"$f":"+(G113)/(G124+G125)","v":0.1031557748378833},{"$f":"+(H113)/(H124+H125)","v":8.1961185271459125E-2}]
[]
["Vakavaraisuus"]
["1. Omavaraisuusaste",null,null,{"$f":"100*(D128+D129)/D130","v":1.4164305949008489},{"$f":"100*(E128+E129)/E130","v":3.5740079262053068E-2},-0.40023233603455732,3.1533291921752908E-2,6.9618297556719133]
["2. Rahoitustulos / Velat (%)",null,null,{"$f":"100*(D107+SUM(D99:D103))/(+D124+D125+D127)","v":7.1379310344827589},{"$f":"100*(E107+SUM(E99:E103))/(+E124+E125+E127)","v":9.0886461742081579},{"$f":"100*(F107+SUM(F99:F103))/(+F124+F125+F127)","v":11.266272312257906},{"$f":"100*(G107+SUM(G99:G103))/(+G124+G125+G127)","v":13.775405912683732},{"$f":"100*(H107+SUM(H99:H103))/(+H124+H125+H127)","v":15.48602505955221}]
[]
["Rahoitusriski"]
["1. Kolmen muuttujan P-luku ","Kriittinen arvo P* = 0,50",null,{"$f":"1/(1+EXP(-(0.843-0.027*D163-0.039*D160-0.01*D159)))","v":0.64944657698332053},{"$f":"1/(1+EXP(-(0.843-0.027*E163-0.039*E160-0.01*E159)))","v":0.66711187983454112},{"$f":"1/(1+EXP(-(0.843-0.027*F163-0.039*F160-0.01*F159)))","v":0.66887376563531686},{"$f":"1/(1+EXP(-(0.843-0.027*G163-0.039*G160-0.01*G159)))","v":0.66580865685279456},{"$f":"1/(1+EXP(-(0.843-0.027*H163-0.039*H160-0.01*H159)))","v":0.62561020797285638}]
[null,"Tulkintalause",null,{"$f":"+IF(D167>0.65,\"Erittäin suuri riski\",IF(D167>0.45,\"Suuri riski\",IF(D167>0.25,\"Kohtuullinen riski\",IF(D167>0.1,\"Suhteellisen pieni riski\",\"Pieni riski\"))))","v":"Suuri riski"},{"$f":"+IF(E167>0.65,\"Erittäin suuri riski\",IF(E167>0.45,\"Suuri riski\",IF(E167>0.25,\"Kohtuullinen riski\",IF(E167>0.1,\"Suhteellisen pieni riski\",\"Pieni riski\"))))","v":"Erittäin suuri riski"},"Erittäin suuri riski","Erittäin suuri riski","Suuri riski"]

{"sheet":"T","index":2,"n_rows":159,"n_cols":15,"rows_kept":159,"cut":false,"hidden":true,"merged":[]}
[null," Copyright Vaasan Yritysinformaatio Oy. Kaikki tekijänoikeudet pidätetään."]
[]
[null,"ENNAKOITU TULOSLASKELMA"]
[null,null,"Ennakoidut viisi vuotta:"]
[null,null,1,2,3,4,5]
[null,{"$f":"+E!A78","v":"Liikevaihto"},{"$f":"+E!D78","v":156600},{"$f":"+E!E78","v":164430},{"$f":"+E!F78","v":172651.5},{"$f":"+E!G78","v":181284.07500000001},{"$f":"+E!H78","v":190348.27875}]
[null,{"$f":"+E!A79","v":" - Muuttuvat kulut"}]
[null,{"$f":"+E!A80","v":"Karkearehu"},{"$f":"+E!D80","v":21600},{"$f":"+E!E80","v":22680},{"$f":"+E!F80","v":23814},{"$f":"+E!G80","v":25004.7},{"$f":"+E!H80","v":26254.934999999998}]
[null,{"$f":"+E!A81","v":"Väkirehu"},{"$f":"+E!D81","v":4320.0000000000009},{"$f":"+E!E81","v":4536.0000000000009},{"$f":"+E!F81","v":4762.8},{"$f":"+E!G81","v":5000.9400000000005},{"$f":"+E!H81","v":5250.9870000000001}]
[null,{"$f":"+E!A82","v":"Kivennäiset"},{"$f":"+E!D82","v":8640.0000000000018},{"$f":"+E!E82","v":9072.0000000000018},{"$f":"+E!F82","v":9525.6},{"$f":"+E!G82","v":10001.880000000001},{"$f":"+E!H82","v":10501.974}]
[null,{"$f":"+E!A83","v":"Muut ruokintakustannukset"},{"$f":"+E!D83","v":8640.0000000000018},{"$f":"+E!E83","v":9072.0000000000018},{"$f":"+E!F83","v":9525.6},{"$f":"+E!G83","v":10001.880000000001},{"$f":"+E!H83","v":10501.974}]
[null,{"$f":"+E!A84","v":"Kuivikekustannukset"},{"$f":"+E!D84","v":10800},{"$f":"+E!E84","v":11340},{"$f":"+E!F84","v":11907},{"$f":"+E!G84","v":12502.35},{"$f":"+E!H84","v":13127.467499999999}]
[null,{"$f":"+E!A85","v":"Täyshoidon muuttuvat palkat lisineen"},{"$f":"+E!D85","v":21600},{"$f":"+E!E85","v":22680},{"$f":"+E!F85","v":23814},{"$f":"+E!G85","v":25004.7},{"$f":"+E!H85","v":26254.934999999998}]
[null,{"$f":"+E!A86","v":"Valmennuksen muuttuvat palkat lisineen"},{"$f":"+E!D86","v":32400},{"$f":"+E!E86","v":34020},{"$f":"+E!F86","v":35721},{"$f":"+E!G86","v":37507.050000000003},{"$f":"+E!H86","v":39382.402499999997}]
[null,{"$f":"+E!A87","v":"Muut muuttuvat kulut"},{"$f":"+E!D87","v":900},{"$f":"+E!E87","v":945},{"$f":"+E!F87","v":992.25},{"$f":"+E!G87","v":1041.8625},{"$f":"+E!H87","v":1093.9556250000001}]
[null,{"$f":"+E!A88","v":" = Myyntikate"},{"$f":"+E!D88","v":47700},{"$f":"+E!E88","v":50085},{"$f":"+E!F88","v":52589.25},{"$f":"+E!G88","v":55218.712499999994},{"$f":"+E!H88","v":57979.648125000007}]
[null,{"$f":"+E!A89","v":" - Kiinteät kulut"}]
[null,{"$f":"+E!A90","v":"Vuokrakulut"},{"$f":"+E!D90","v":0},{"$f":"+E!E90","v":0},{"$f":"+E!F90","v":0},{"$f":"+E!G90","v":0},{"$f":"+E!H90","v":0}]
[null,{"$f":"+E!A91","v":"Sähkökulut"},{"$f":"+E!D91","v":2400},{"$f":"+E!E91","v":2472},{"$f":"+E!F91","v":2546.16},{"$f":"+E!G91","v":2622.5448000000001},{"$f":"+E!H91","v":2701.2211439999996}]
[null,{"$f":"+E!A92","v":"Vesikulut"},{"$f":"+E!D92","v":1200},{"$f":"+E!E92","v":1236},{"$f":"+E!F92","v":1273.08},{"$f":"+E!G92","v":1311.2724000000001},{"$f":"+E!H92","v":1350.6105719999998}]
[null,{"$f":"+E!A93","v":"Pohjien huolto"},{"$f":"+E!D93","v":3000},{"$f":"+E!E93","v":3090},{"$f":"+E!F93","v":3182.7},{"$f":"+E!G93","v":3278.181},{"$f":"+E!H93","v":3376.5264299999999}]
[null,{"$f":"+E!A94","v":"Lantalan tyhjennys"},{"$f":"+E!D94","v":1200},{"$f":"+E!E94","v":1236},{"$f":"+E!F94","v":1273.08},{"$f":"+E!G94","v":1311.2724000000001},{"$f":"+E!H94","v":1350.6105719999998}]
[null,{"$f":"+E!A95","v":"Kiinteät palkkakustannukset lisineen"},{"$f":"+E!D95","v":12000},{"$f":"+E!E95","v":12360},{"$f":"+E!F95","v":12730.8},{"$f":"+E!G95","v":13112.724},{"$f":"+E!H95","v":13506.10572}]
[null,"Muut kiinteät kulut",{"$f":"+E!D96","v":1200},{"$f":"+E!E96","v":1236},{"$f":"+E!F96","v":1273.08},{"$f":"+E!G96","v":1311.2724000000001},{"$f":"+E!H96","v":1350.6105719999998}]
[null,{"$f":"+E!A97","v":" = Käyttökate"},{"$f":"+E!D97","v":26700},{"$f":"+E!E97","v":28455},{"$f":"+E!F97","v":30310.35},{"$f":"+E!G97","v":32271.445499999994},{"$f":"+E!H97","v":34343.963115000006}]
[null,{"$f":"+E!A98","v":" - Poistot"}]
[null,{"$f":"+E!A99","v":"Maa- ja vesialueet"},{"$f":"+E!D99","v":0},{"$f":"+E!E99","v":0},{"$f":"+E!F99","v":0},{"$f":"+E!G99","v":0},{"$f":"+E!H99","v":0}]
[null,{"$f":"+E!A100","v":"Rakennukset ja rakennelmat"},{"$f":"+E!D100","v":13333.333333333334},{"$f":"+E!E100","v":13333.333333333334},{"$f":"+E!F100","v":13333.333333333334},{"$f":"+E!G100","v":13333.333333333334},{"$f":"+E!H100","v":13333.333333333334}]
[null,{"$f":"+E!A101","v":"Koneet ja kalusto"},{"$f":"+E!D101","v":12500},{"$f":"+E!E101","v":12500},{"$f":"+E!F101","v":12500},{"$f":"+E!G101","v":12500},{"$f":"+E!H101","v":0}]
[null,{"$f":"+E!A102","v":"Aineeton käyttöomaisuus"},{"$f":"+E!D102","v":200},{"$f":"+E!E102","v":200},{"$f":"+E!F102","v":200},{"$f":"+E!G102","v":200},{"$f":"+E!H102","v":200}]
[null,{"$f":"+E!A103","v":"Muu käyttöomaisuus"},{"$f":"+E!D103","v":500},{"$f":"+E!E103","v":500},{"$f":"+E!F103","v":0},{"$f":"+E!G103","v":0},{"$f":"+E!H103","v":0}]
[null,{"$f":"+E!A104","v":" = Liiketulos"},{"$f":"+E!D104","v":166.66666666666424},{"$f":"+E!E104","v":1921.6666666666642},{"$f":"+E!F104","v":4277.0166666666628},{"$f":"+E!G104","v":6238.1121666666586},{"$f":"+E!H104","v":20810.62978166667}]
[null,{"$f":"+E!A105","v":" - Korkokulut"},{"$f":"+E!D105","v":6000},{"$f":"+E!E105","v":6000},{"$f":"+E!F105","v":5251.9949999999999},{"$f":"+E!G105","v":5052.5766000000003},{"$f":"+E!H105","v":4796.0726089}]
[null,{"$f":"+E!A106","v":" - Verot"},{"$f":"+E!D106","v":0},{"$f":"+E!E106","v":0},{"$f":"+E!F106","v":0},{"$f":"+E!G106","v":237.10711333333165},{"$f":"+E!H106","v":3202.9114345533344}]
[null,{"$f":"+E!A107","v":"Tilikauden tulos"},{"$f":"+E!D107","v":-5833.3333333333358},{"$f":"+E!E107","v":-4078.3333333333358},{"$f":"+E!F107","v":-974.9783333333371},{"$f":"+E!G107","v":948.42845333332662},{"$f":"+E!H107","v":12811.645738213336}]
[]
[null,"ENNAKOITU TASE"]
[null,null,{"$f":"+C4","v":"Ennakoidut viisi vuotta:"}]
[null,null,1,2,3,4,5]
[null,{"$f":"+E!A111","v":"Taseen omaisuus"}]
[null,{"$f":"+E!A112","v":"Lyhytaikainen:"}]
[null,{"$f":"+E!A113","v":"Rahoitusomaisuus"},{"$f":"+E!D113","v":28700},{"$f":"+E!E113","v":8221.5},{"$f":"+E!F113","v":8632.5750000000007},{"$f":"+E!G113","v":9064.2037500000006},{"$f":"+E!H113","v":9517.4139374999995}]
[null,{"$f":"+E!A114","v":"Pitkäaikainen:"}]
[null,{"$f":"+E!A115","v":"Maa- ja vesialueet"},{"$f":"+E!D115","v":40000},{"$f":"+E!E115","v":40000},{"$f":"+E!F115","v":40000},{"$f":"+E!G115","v":40000},{"$f":"+E!H115","v":40000}]
[null,{"$f":"+E!A116","v":"Rakennukset ja rakennelmat"},{"$f":"+E!D116","v":186666.66666666666},{"$f":"+E!E116","v":173333.33333333331},{"$f":"+E!F116","v":159999.99999999997},{"$f":"+E!G116","v":146666.66666666663},{"$f":"+E!H116","v":133333.33333333328}]
[null,{"$f":"+E!A117","v":"Koneet ja kalusto"},{"$f":"+E!D117","v":37500},{"$f":"+E!E117","v":25000},{"$f":"+E!F117","v":12500},{"$f":"+E!G117","v":0},{"$f":"+E!H117","v":0}]
[null,{"$f":"+E!A118","v":"Aineeton käyttöomaisuus"},{"$f":"+E!D118","v":800},{"$f":"+E!E118","v":600},{"$f":"+E!F118","v":400},{"$f":"+E!G118","v":200},{"$f":"+E!H118","v":0}]
[null,{"$f":"+E!A119","v":"Muu käyttöomaisuus"},{"$f":"+E!D119","v":500},{"$f":"+E!E119","v":0},{"$f":"+E!F119","v":0},{"$f":"+E!G119","v":0},{"$f":"+E!H119","v":0}]
[null,{"$f":"+E!A120","v":"Yhteensä"},{"$f":"+E!D120","v":294166.66666666663},{"$f":"+E!E120","v":247154.83333333331},{"$f":"+E!F120","v":221532.57499999998},{"$f":"+E!G120","v":195930.87041666661},{"$f":"+E!H120","v":182850.74727083329}]
[]
[null,{"$f":"+E!A122","v":"Taseen pääoma"}]
[null,{"$f":"+E!A123","v":"Lyhytaikainen:"}]
[null,{"$f":"+E!A124","v":"Lyhytaikaiset velat (maks. voitto-osuus)"},{"$f":"+E!D124","v":0},{"$f":"+E!E124","v":0},{"$f":"+E!F124","v":0},{"$f":"+E!G124","v":0},{"$f":"+E!H124","v":143.67145957733274}]
[null,{"$f":"+E!A125","v":"Muu lyhytaikainen vieras pääoma"},{"$f":"+E!D125","v":20000},{"$f":"+E!E125","v":31066.5},{"$f":"+E!F125","v":60419.22},{"$f":"+E!G125","v":87869.086963333335},{"$f":"+E!H125","v":115977.31807928666}]
[null,{"$f":"+E!A126","v":"Pitkäaikainen:"}]
[null,{"$f":"+E!A127","v":"Pitkäaikainen vieras pääoma"},{"$f":"+E!D127","v":270000},{"$f":"+E!E127","v":216000},{"$f":"+E!F127","v":162000},{"$f":"+E!G127","v":108000},{"$f":"+E!H127","v":54000}]
[null,{"$f":"+E!A128","v":"Sijoitettu oma pääoma"},{"$f":"+E!D128","v":10000},{"$f":"+E!E128","v":10000},{"$f":"+E!F128","v":10000},{"$f":"+E!G128","v":10000},{"$f":"+E!H128","v":10000}]
[null,{"$f":"+E!A129","v":"Kertyneet voittovarat ja muu oma pääoma"},{"$f":"+E!D129","v":-5833.3333333333358},{"$f":"+E!E129","v":-9911.6666666666715},{"$f":"+E!F129","v":-10886.645000000008},{"$f":"+E!G129","v":-9938.2165466666811},{"$f":"+E!H129","v":2729.7577319693219}]
[null,{"$f":"+E!A130","v":"Yhteensä"},{"$f":"+E!D130","v":294166.66666666669},{"$f":"+E!E130","v":247154.83333333331},{"$f":"+E!F130","v":221532.57499999998},{"$f":"+E!G130","v":195930.87041666664},{"$f":"+E!H130","v":182850.74727083332}]
[]
[null,"ENNAKOIDUT TUNNUSLUVUT"]
[null,null,{"$f":"+C4","v":"Ennakoidut viisi vuotta:"}]
[null,null,{"$f":"+E!D139","v":1},{"$f":"+E!E139","v":2},{"$f":"+E!F139","v":3},{"$f":"+E!G139","v":4},{"$f":"+E!H139","v":5}]
[null,"Koko"]
[null,{"$f":"+E!A141","v":"1. Liikevaihto (Euro)"},{"$f":"+E!D141","v":156600},{"$f":"+E!E141","v":164430},{"$f":"+E!F141","v":172651.5},{"$f":"+E!G141","v":181284.07500000001},{"$f":"+E!H141","v":190348.27875}]
[null,{"$f":"+E!A142","v":"2. Taseen loppusumma (Euro)"},{"$f":"+E!D142","v":294166.66666666663},{"$f":"+E!E142","v":247154.83333333331},{"$f":"+E!F142","v":221532.57499999998},{"$f":"+E!G142","v":195930.87041666661},{"$f":"+E!H142","v":182850.74727083329}]
[null,{"$f":"+E!A143","v":"3. Tilikauden tulos (Euro)"},{"$f":"+E!D143","v":-5833.3333333333358},{"$f":"+E!E143","v":-4078.3333333333358},{"$f":"+E!F143","v":-974.9783333333371},{"$f":"+E!G143","v":948.42845333332662},{"$f":"+E!H143","v":12811.645738213336}]
[null,{"$f":"+E!A144","v":"4. Voitto-osuus omistajalle (Euro)"},{"$f":"+E!D144","v":0},{"$f":"+E!E144","v":0},{"$f":"+E!F144","v":0},{"$f":"+E!G144","v":0},{"$f":"+E!H144","v":143.67145957733274}]
[]
[null,{"$f":"+E!A146","v":"Kasvu"}]
[null,{"$f":"+E!A147","v":"1. Liikevaihdon kasvu-%"},null,{"$f":"+E!E147","v":5},{"$f":"+E!F147","v":5},{"$f":"+E!G147","v":5},{"$f":"+E!H147","v":5}]
[null,{"$f":"+E!A148","v":"2. Taseen loppusumman kasvu-%"},null,{"$f":"+E!E148","v":-15.981359773371096},{"$f":"+E!F148","v":-10.366885400447345},{"$f":"+E!G148","v":-11.556632058889477},{"$f":"+E!H148","v":-6.6758868155983464}]
[null,{"$f":"+E!A149","v":"3. Tilikauden tuloksen kasvu-%"},null,{"$f":"+E!E149","v":-30.085714285714275},{"$f":"+E!F149","v":-76.093706579485001},{"$f":"+E!G149","v":-197.27687487072257},{"$f":"+E!H149","v":1250.8289099916599}]
[]
[null,{"$f":"+E!A151","v":"Kannattavuus"}]
[null,{"$f":"+E!A152","v":"1. Käyttökate / Liikevaihto (%)"},{"$f":"+E!D152","v":17.049808429118773},{"$f":"+E!E152","v":17.305236270753511},{"$f":"+E!F152","v":17.555798820166636},{"$f":"+E!G152","v":17.801588749590934},{"$f":"+E!H152","v":18.04269696607383}]
[null,{"$f":"+E!A153","v":"2. Liiketulos / Liikevaihto (%)"},{"$f":"+E!D153","v":0.10642826734780603},{"$f":"+E!E153","v":1.1686837357335427},{"$f":"+E!F153","v":2.477254276196073},{"$f":"+E!G153","v":3.4410701362856382},{"$f":"+E!H153","v":10.932922492563737}]
[null,{"$f":"+E!A154","v":"3. Tilikauden tulos / Liikevaihto (%)"},{"$f":"+E!D154","v":-3.7249893571732668},{"$f":"+E!E154","v":-2.4802854304770032},{"$f":"+E!F154","v":-0.56470886921534835},{"$f":"+E!G154","v":0.52317251437189205},{"$f":"+E!H154","v":6.7306338793007523}]
[null,{"$f":"+E!A155","v":"4. Sijoitetun pääoman tuotto-%"},null,{"$f":"+E!E155","v":0.65325779036827125},{"$f":"+E!F155","v":1.7305009208127955},{"$f":"+E!G155","v":2.8158893411800316},{"$f":"+E!H155","v":10.621414449601934}]
[null,{"$f":"+E!A156","v":"5. Oman pääoman tuotto-%"},null,{"$f":"+E!E156","v":-97.880000000000123},{"$f":"+E!F156","v":-1103.7490566038384},{"$f":"+E!G156","v":""},{"$f":"+E!H156","v":20736.370414737248}]
[]
[null,{"$f":"+E!A158","v":"Maksuvalmius"}]
[null,{"$f":"+E!A159","v":"1. Rahoitustulos / Liikevaihto"},{"$f":"+E!D159","v":13.218390804597702},{"$f":"+E!E159","v":13.656267104542966},{"$f":"+E!F159","v":14.513835674755216},{"$f":"+E!G159","v":14.883691127677189},{"$f":"+E!H159","v":13.840408352810845}]
[null,{"$f":"+E!A160","v":"2. Quick ratio"},{"$f":"+E!D160","v":1.4350000000000001},{"$f":"+E!E160","v":0.2646419776930134},{"$f":"+E!F160","v":0.14287796168172975},{"$f":"+E!G160","v":0.1031557748378833},{"$f":"+E!H160","v":8.1961185271459125E-2}]
[]
[null,{"$f":"+E!A162","v":"Vakavaraisuus"}]
[null,{"$f":"+E!A163","v":"1. Omavaraisuusaste"},{"$f":"+E!D163","v":1.4164305949008489},{"$f":"+E!E163","v":3.5740079262053068E-2},{"$f":"+E!F163","v":-0.40023233603455732},{"$f":"+E!G163","v":3.1533291921752908E-2},{"$f":"+E!H163","v":6.9618297556719133}]
[null,{"$f":"+E!A164","v":"2. Rahoitustulos / Velat (%)"},{"$f":"+E!D164","v":7.1379310344827589},{"$f":"+E!E164","v":9.0886461742081579},{"$f":"+E!F164","v":11.266272312257906},{"$f":"+E!G164","v":13.775405912683732},{"$f":"+E!H164","v":15.48602505955221}]
[]
[null,"Rahoitusriski: Taipumus kuulua konkurssiyritysten (1) tai toimivien yritysten (0) joukkoon"]
[null,{"$f":"+E!A167","v":"1. Kolmen muuttujan P-luku "},{"$f":"+E!D167","v":0.64944657698332053},{"$f":"+E!E167","v":0.66711187983454112},{"$f":"+E!F167","v":0.66887376563531686},{"$f":"+E!G167","v":0.66580865685279456},{"$f":"+E!H167","v":0.62561020797285638}]
[]
[]
[null,"TULKINTARAPORTTI"]
[]
[null,null,{"$f":"+C4","v":"Ennakoidut viisi vuotta:"}]
[null,null,1,2,3,4,5]
[null,"Kannattavuus"]
[null,"Käyttökate / Myyntituotot (%)",{"$f":"+IF(C76>0,\"Positiivinen\",\"Negatiivinen\")","v":"Positiivinen"},{"$f":"+IF(D76>0,\"Positiivinen\",\"Negatiivinen\")","v":"Positiivinen"},{"$f":"+IF(E76>0,\"Positiivinen\",\"Negatiivinen\")","v":"Positiivinen"},{"$f":"+IF(F76>0,\"Positiivinen\",\"Negatiivinen\")","v":"Positiivinen"},{"$f":"+IF(G76>0,\"Positiivinen\",\"Negatiivinen\")","v":"Positiivinen"}]
[null,"Sijoitetun pääoman tuotto-%",null,{"$f":"+IF(D79>15,\"Erinomainen\",IF(D79>10,\"Hyvä\",IF(D79>6,\"Tyydyttävä\",IF(D79>3,\"Välttävä\",\"Heikko\"))))","v":"Heikko"},{"$f":"+IF(E79>15,\"Erinomainen\",IF(E79>10,\"Hyvä\",IF(E79>6,\"Tyydyttävä\",IF(E79>3,\"Välttävä\",\"Heikko\"))))","v":"Heikko"},{"$f":"+IF(F79>15,\"Erinomainen\",IF(F79>10,\"Hyvä\",IF(F79>6,\"Tyydyttävä\",IF(F79>3,\"Välttävä\",\"Heikko\"))))","v":"Heikko"},{"$f":"+IF(G79>15,\"Erinomainen\",IF(G79>10,\"Hyvä\",IF(G79>6,\"Tyydyttävä\",IF(G79>3,\"Välttävä\",\"Heikko\"))))","v":"Hyvä"}]
[null,"Oman pääoman tuotto-%",null,{"$f":"+IF(D80=\"\",\"\",IF(D80>20,\"Erinomainen\",IF(D80>15,\"Hyvä\",IF(D80>10,\"Tyydyttävä\",IF(D80>5,\"Välttävä\",\"Heikko\")))))","v":"Heikko"},{"$f":"+IF(E80=\"\",\"\",IF(E80>20,\"Erinomainen\",IF(E80>15,\"Hyvä\",IF(E80>10,\"Tyydyttävä\",IF(E80>5,\"Välttävä\",\"Heikko\")))))","v":"Heikko"},"","Erinomainen"]
[]
[null,"Maksuvalmius"]
[null,"Rahoitustulos / Myyntituotot",{"$f":"+IF(C83>0,\"Positiivinen\",\"Negatiivinen\")","v":"Positiivinen"},{"$f":"+IF(D83>0,\"Positiivinen\",\"Negatiivinen\")","v":"Positiivinen"},{"$f":"+IF(E83>0,\"Positiivinen\",\"Negatiivinen\")","v":"Positiivinen"},{"$f":"+IF(F83>0,\"Positiivinen\",\"Negatiivinen\")","v":"Positiivinen"},{"$f":"+IF(G83>0,\"Positiivinen\",\"Negatiivinen\")","v":"Positiivinen"}]
[null,"Quick ratio",{"$f":"+IF(C84>1.5,\"Erinomainen\",IF(C84>1,\"Hyvä\",IF(C84>0.5,\"Tyydyttävä\",IF(C84>0.3,\"Välttävä\",\"Heikko\"))))","v":"Hyvä"},{"$f":"+IF(D84>1.5,\"Erinomainen\",IF(D84>1,\"Hyvä\",IF(D84>0.5,\"Tyydyttävä\",IF(D84>0.3,\"Välttävä\",\"Heikko\"))))","v":"Heikko"},{"$f":"+IF(E84>1.5,\"Erinomainen\",IF(E84>1,\"Hyvä\",IF(E84>0.5,\"Tyydyttävä\",IF(E84>0.3,\"Välttävä\",\"Heikko\"))))","v":"Heikko"},{"$f":"+IF(F84>1.5,\"Erinomainen\",IF(F84>1,\"Hyvä\",IF(F84>0.5,\"Tyydyttävä\",IF(F84>0.3,\"Välttävä\",\"Heikko\"))))","v":"Heikko"},{"$f":"+IF(G84>1.5,\"Erinomainen\",IF(G84>1,\"Hyvä\",IF(G84>0.5,\"Tyydyttävä\",IF(G84>0.3,\"Välttävä\",\"Heikko\"))))","v":"Heikko"}]
[]
[null,"Vakavaraisuus"]
[null,"Omavaraisuusaste",{"$f":"+IF(C87>50,\"Erinomainen\",IF(C87>35,\"Hyvä\",IF(C87>25,\"Tyydyttävä\",IF(C87>15,\"Välttävä\",\"Heikko\"))))","v":"Heikko"},{"$f":"+IF(D87>50,\"Erinomainen\",IF(D87>35,\"Hyvä\",IF(D87>25,\"Tyydyttävä\",IF(D87>15,\"Välttävä\",\"Heikko\"))))","v":"Heikko"},"Heikko","Heikko","Heikko"]
[null,"Rahoitustulos / Velat (%)",{"$f":"+IF(1/(C88/100)<1,\"Erinomainen\",IF(1/(C88/100)<3,\"Hyvä\",IF(1/(C88/100)<5,\"Tyydyttävä\",IF(1/(C88/100)<10,\"Välttävä\",\"Heikko\"))))","v":"Heikko"},{"$f":"+IF(1/(D88/100)<1,\"Erinomainen\",IF(1/(D88/100)<3,\"Hyvä\",IF(1/(D88/100)<5,\"Tyydyttävä\",IF(1/(D88/100)<10,\"Välttävä\",\"Heikko\"))))","v":"Heikko"},"Välttävä","Välttävä","Välttävä"]
[]
[null,"Rahoitusriski"]
[null,"Kolmen muuttujan P-luku",{"$f":"+IF(C91>0.65,\"Erittäin suuri riski\",IF(C91>0.45,\"Suuri riski\",IF(C91>0.25,\"Kohtuullinen riski\",IF(C91>0.1,\"Suhteellisen pieni riski\",\"Pieni riski\"))))","v":"Suuri riski"},{"$f":"+IF(D91>0.65,\"Erittäin suuri riski\",IF(D91>0.45,\"Suuri riski\",IF(D91>0.25,\"Kohtuullinen riski\",IF(D91>0.1,\"Suhteellisen pieni riski\",\"Pieni riski\"))))","v":"Erittäin suuri riski"},"Erittäin suuri riski","Erittäin suuri riski","Suuri riski"]
[]
[]
[null,"LIITEKUVIOT"]
[null,null,null,null,null,null,null,null,null,"Vuosi",1,2,3,4,5]
[null,null,null,null,null,null,null,null,null,"Käyttökate",{"$f":"+C25","v":26700},{"$f":"+D25","v":28455},{"$f":"+E25","v":30310.35},{"$f":"+F25","v":32271.445499999994},{"$f":"+G25","v":34343.963115000006}]
[null,null,null,null,null,null,null,null,null,"Liiketulos",{"$f":"+C32","v":166.66666666666424},{"$f":"+D32","v":1921.6666666666642},{"$f":"+E32","v":4277.0166666666628},{"$f":"+F32","v":6238.1121666666586},{"$f":"+G32","v":20810.62978166667}]
[null,null,null,null,null,null,null,null,null,"Tilikauden tulos",{"$f":"+C35","v":-5833.3333333333358},{"$f":"+D35","v":-4078.3333333333358},{"$f":"+E35","v":-974.9783333333371},{"$f":"+F35","v":948.42845333332662},{"$f":"+G35","v":12811.645738213336}]
[]
[]
[]
[]
[]
[]
[]
[]
[]
[]
[]
[]
[]
[]
[]
[]
[]
[null,null,null,null,null,null,null,null,null,"Vuosi",1,2,3,4,5]
[null,null,null,null,null,null,null,null,null,"Sijoitetun pääoman tuotto-%",null,{"$f":"+D79","v":0.65325779036827125},{"$f":"+E79","v":1.7305009208127955},{"$f":"+F79","v":2.8158893411800316},{"$f":"+G79","v":10.621414449601934}]
[null,null,null,null,null,null,null,null,null,"Quick ratio",{"$f":"+C84","v":1.4350000000000001},{"$f":"+D84","v":0.2646419776930134},{"$f":"+E84","v":0.14287796168172975},{"$f":"+F84","v":0.1031557748378833},{"$f":"+G84","v":8.1961185271459125E-2}]
[null,null,null,null,null,null,null,null,null,"Omavaraisuusaste",{"$f":"+C87","v":1.4164305949008489},3.5740079262053068E-2,-0.40023233603455732,3.1533291921752908E-2,6.9618297556719133]
[]
[]
[]
[]
[]
[]
[]
[]
[]
[]
[]
[]
[]
[]
[]
[]
[null,null,null,null,null,null,null,null,null,"Vuosi",1,2,3,4,5]
[null,null,null,null,null,null,null,null,null,"Rahoitusriski",{"$f":"+C91","v":0.64944657698332053},{"$f":"+D91","v":0.66711187983454112},0.66887376563531686,0.66580865685279456,0.62561020797285638]
[null,null,null,null,null,null,null,null,null,"Kriittinen taso",0.5,0.5,0.5,0.5,0.5]