{"text_format":"1","workbook":"xlsx","n_sheets":3,"sheets":["K","E","T"],"not_rendered":{"charts":6,"images":0,"macros":0,"external_links":0,"defined_names":0,"comments":0,"pivot_tables":0},"unopened":[],"bounds":{"document_bytes":16777216,"sheet_cells":100000,"rows_first":2000,"rows_last":500,"rows_between":2000,"halvings":0,"cell_chars":16384,"cell_head_chars":4096},"cells_cut":0,"cells_raw":0,"read":"whole","date_system":"1900"}

{"sheet":"K","index":0,"n_rows":299,"n_cols":8,"rows_kept":299,"cut":false,"hidden":false,"merged":[[11,0,11,6],[14,0,14,4],[101,0,101,4],[90,0,90,4],[80,0,80,3],[81,0,81,3],[82,0,82,3],[83,0,83,3],[74,0,74,3],[75,0,75,3],[76,0,76,3],[69,0,69,3],[70,0,70,3],[71,0,71,3],[72,0,72,3],[73,0,73,3],[103,0,103,4],[5,0,5,6],[97,0,97,4],[98,0,98,4],[99,0,99,4],[100,0,100,4],[91,0,91,4],[92,0,92,4],[95,0,95,4],[96,0,96,4],[84,0,84,3],[85,0,85,3],[86,0,86,3],[87,0,87,3],[9,0,9,6],[25,0,25,6],[56,0,56,4],[58,0,58,4],[60,0,60,4],[68,0,68,3],[57,0,57,4],[45,0,45,4],[52,0,52,4],[53,0,53,4],[54,0,54,4],[55,0,55,4],[7,0,7,4],[13,0,13,4],[37,0,37,4],[298,0,298,5],[3,0,3,6],[19,0,19,4],[20,0,20,4],[21,0,21,4],[16,0,16,4],[41,0,41,4],[42,0,42,4],[43,0,43,4],[44,0,44,4],[46,0,46,4],[47,0,47,4],[48,0,48,4]]}
[]
["TOIMIVAN TÄYSIHOITO/VALMENNUSTALLIN TILINPÄÄTÖSTEN ENNAKOINTI VIIDELLE VUODELLE"]
[]
["Tällä laskentamallilla voit helposti laatia jo toimivalle täysihoito/valmennustallillesi alustavan taloudellisen laskelman seuraavan viiden vuoden toiminnasta.  Valmennettavien hevosten lisäksi sinulla on mahdollisuus sisällyttää laskelmiin vain täysihoitoon otettuja hevosia. Syötä laskentaa varten malliin ensin tiedot tallisi viime tilinpäätöksen liikevaihdosta, taseen omaisuudesta ja poistoista, yrityksesi veroprosentista, velkojen koroista ja lyhennyksistä, sinun voitto-osuudestasi, rahoitusomaisuuden riittävästä määrästä sekä arvioi liikevaihdon ja kiinteiden kulujen kasvuprosentit ajanjaksolle. Syötä tämän jälkeen yrityksesi seuraavalle toimintavuodelle ennakoimasi tulot ja kulut, investoinnit ja rahoitus. Tässä laskentamallissa ei oteta huomioon arvonlisäveroa."]
[]
["Taulukossa on valmiina esimerkkinä kuvitteellisen täysihoito/valmennustallin luvut. Tässä omissa tiloissa toimivassa tallissa on pelkästään täysihoidossa 10 hevosta ja täysihoito/valmennuksessa 10 hevosta. Talli rahoittaa toimintansa lyhytaikaisella ja pitkäaikaisella velalla ja omalla pääomalla. Muuta taulukon vihreissä ruuduissa olevat tallin esimerkkiluvut oman tallisi arvioiduiksi luvuiksi. Pohdi antamiasi lukuja mahdollisimman huolellisesti."]
[]
["Miten suuri täyshoito/valmennustallisi liikevaihto oli viime tilinpäätöksessä (tuloslaskelmassa)?",null,null,null,null,200000,"euroa",{"$f":"+IF(F8>=0,\"\",\"Luvun pitää olla positiivinen!\")","v":""}]
[]
["Syötä viime tilinpäätöksen taseen tiedot niin, että omaisuuspuoli (vastaavaa) ja pääomapuoli (vastattavaa) ovat yhtä suuret (samat kuin taseessa). "]
[]
["Omaisuuspuoli eli vastaavaa: lyhyt- ja pitkäaikainen omaisuus"]
[null,null,null,null,null,"Taseen arvo"]
["Miten paljon viime tilinpäätöksen taseessa oli yhteensä rahoitusomaisuutta (kassa ja pankkitili) ja muuta lyhytaikaista omaisuutta? ",null,null,null,null,10000,"euroa",{"$f":"+IF(F14>=0,\"\",\"Luvun pitää olla positiivinen tai nolla!\")","v":""}]
["Laita tähän kaikki lyhytaikainen omaisuus taseesta (rahoitus-, vaihto ja muu lyhytaikainen omaisuus)."]
[]
["Miten paljon viime tilinpäätöksen taseessa oli pitkäaikaista omaisuutta alla olevan jaon mukaisesti? Miten suuret poistot tästä pitkäaikaisesta omaisuudesta tehtiin tuloslaskelmassa? Laita jäljelle jäävät erät muuhun käyttöomaisuuteen."]
[]
["Huom! Ota omaisuuden todelliset luvut suoraan viimeisestä taseesta ja poistot viimeisestä tuloslaskelmasta!",null,null,null,null,"Taseen arvo","Tehty poisto"]
["Taseen pitkäaikaiseen omaisuuteen kirjatut maa- ja vesialueet (esim. tontti)?",null,null,null,null,20000,0,{"$f":"+IF(F20>=0,\"\",\"Luvun pitää olla positiivinen tai nolla!\")","v":""}]
["Taseen pitkäaikaiseen omaisuuteen kirjatut rakennukset ja rakennelmat  (esim. maneesi, talli, harjoitusravirata, tarhat))?",null,null,null,null,100000,5000,""]
["Taseen pitkäaikaiseen omaisuuteen kirjatut koneet ja kalusto  (esim. traktori, lana, pienkuormaaja)?",null,null,null,null,35000,5000,""]
["Taseen pitkäaikaiseen omaisuuteen kirjattu aineeton omaisuus  (esim. tietokoneohjelmat)?",null,null,null,null,1000,250,""]
["Taseen pitkäaikaiseen omaisuuteen kirjattu muu käyttöomaisuus (esim. työkalut, muut tarvikkeet)?",null,null,null,null,1000,250,""]
[]
["Pääomapuoli eli vastattavaa: lyhyt- ja pitkäaikaiset velat (vieras pääoma) ja oma pääoma"]
[]
["Jaa kaikki taseen pääomapuolella eli vastattavissa olevat erät lyhyt- ja pitkäaikaisiin velkoihin ja omaan pääomaan."]
["(summan pitää vastata taseen vastattavien summaa)",null,null,null,null,"Taseen arvo"]
["Miten paljon viime tilikauden taseessa oli lyhytaikaista (alle vuoden mittaista) velkaa?",null,null,null,null,10000,"euroa",{"$f":"+IF(F30>=0,\"\",\"Luvun pitää olla positiivinen tai nolla!\")","v":""}]
["Miten paljon viime tilikauden taseessa oli pitkäaikaista (yli vuoden mittaista) velkaa?",null,null,null,null,145000,"euroa",""]
["Miten paljon viime tilikauden omassa pääomassa oli kertyneitä voittovaroja?",null,null,null,null,2000,"euroa",""]
["Miten paljon viime tilikauden omassa pääomassa oli muuta omaa pääomaa? (kaikki muut erät kuin kertyneet voittovarat)",null,null,null,null,10000,"euroa",""]
[]
["Huomaa, että olet edellä ilmoittanut viime tilikauden taseen  lyhyt- ja pitkäaikaiseksi omaisuudeksi yhteensä:",null,null,null,null,{"$f":"+F14+SUM(F20:F24)","v":167000},"euroa"]
["Huomaa, että olet edellä ilmoittanut viime tilikauden taseen pääomaksi (oma ja vieras pääoma) yhteensä:",null,null,null,null,{"$f":"+SUM(F30:F33)","v":167000},"euroa"]
[]
[{"$f":"+IF(F35=F36,\"Viime tilinpäätöksen taseen omaisuus- ja pääomapuoli ovat kuten pitääkin yhtä suuret, joten jatka tietojen syöttämistä.\",\"Viime tilinpäätöksen taseen omaisuus- ja pääomapuoli eivät ole yhtä suuria! Korjaa annettuja tietoja.\")","v":"Viime tilinpäätöksen taseen omaisuus- ja pääomapuoli ovat kuten pitääkin yhtä suuret, joten jatka tietojen syöttämistä."}]
[]
["Syötä sen jälkeen seuraavat laskennassa tarvittavat tiedot:"]
[null,null,null,null,null,"Muut tiedot","%-osuus"]
["Kuinka monta prosenttia yrityksesi maksaa veroja verotettavasta tuloksesta? (esim. osakeyhtiöillä verokanta on 20 % 2021)",null,null,null,null,20,{"$f":"+F42/100","v":0.2},{"$f":"+IF(F42>=0,\"\",\"Luvun pitää olla positiivinen tai nolla!\")","v":""}]
["Miten korkea on yrityksesi lyhytaikaisen (alle vuoden mittaisen) velan vuotuinen korkoprosentti?",null,null,null,null,3,0.03,""]
["Miten korkea on yrityksesi pitkäaikaisen (yli vuoden mittaisen) velan vuotuinen korkoprosentti?",null,null,null,null,2,0.02,""]
["Miten monta prosenttia (suunnilleen) pitkäaikaisesta velasta maksetaan vuosittain takaisin? ",null,null,null,null,15,0.15,""]
["Miten paljon aiot nostaa yrityksestä voitto-osuutta (esim. osinkoja) prosentteina yrityksen tuottamista kertyneistä voitoista?",null,null,null,null,5,0.05,""]
["Miten paljon vähintään aiot pitää varoja lyhytaikaisessa omaisuudessa toiminnan pyörittämistä varten prosentteina liikevaihdosta?",null,null,null,null,5,0.05,""]
["Miten monta prosenttia arvioit yrityksesi liikevaihdon kasvavan vuosittain seuraavien viiden vuoden aikana?",null,null,null,null,5,0.05,""]
["Miten monta prosenttia arvioit yrityksesi kiinteiden kustannusten kasvavan vuosittain seuraavien viiden vuoden aikana?",null,null,null,null,3,0.03,""]
[]
["Laadi sen jälkeen arvio täysihoito/valmennustallisi seuraavan vuoden liikevaihdosta. "]
[]
["Minkä hintaiseksi arvioit pelkän täysihoitopaikan hinnan hevosta kohti kuukaudessa? (euroa / hevonen / kuukausi)",null,null,null,null,500,"euroa / kk",{"$f":"+IF(F53>=0,\"\",\"Luvun pitää olla positiivinen tai nolla!\")","v":""}]
["Kuinka monta hevosta sinulla on tarkoitus ottaa pelkälle täysihoitopaikalle?",null,null,null,null,10,"hevosta",""]
["Millaiseksi arvioit tallin käyttöasteen vain täysihoitopaikoissa keskimäärin prosentteina 0 - 100 % (täysi talli)?",null,null,null,null,90,"%",""]
["Minkä hintaiseksi arvioit täysihoito- ja valmennuspaikan hinnan hevosta kohti kuukaudessa? (euroa / hevonen / kuukausi)",null,null,null,null,950,"euroa / kk",""]
["Kuinka monta hevosta sinulla on tarkoitus ottaa täysihoito/valmennuspaikalle?",null,null,null,null,10,"hevosta",""]
["Millaiseksi arvioit tallin käyttöasteen täysihoito/valmennuspaikoissa keskimäärin prosentteina 0 - 100 % (täysi talli)?",null,null,null,null,90,"%",""]
["Esittämiesi lukujen perusteella seuraavan vuoden liikevaihto siten seuraava:",null,null,null,null,{"$f":"12*F53*F54*F55/100+12*F56*F57*F58/100","v":156600},"euroa"]
[]
["Täysihoito/valmennustallisi seuraavan vuoden ennakoitu liikevaihto on:",null,null,null,null,{"$f":"+F59","v":156600},"euroa"]
["Pelkästään täysihoidossa on keskimäärin hevosia käyttöaste huomioiden:",null,null,null,null,{"$f":"+F54*F55/100","v":9},"hevosta"]
["Täysihoito/valmennuksessa on keskimäärin hevosia käyttäaste huomioiden:",null,null,null,null,{"$f":"+F57*F58/100","v":9},"hevosta"]
["Hevosia on tallissasi keskimäärin yhteensä käyttöaste huomioiden:",null,null,null,null,{"$f":"+F62+F63","v":18},"hevosta",{"$f":"+IF(F64>=0,\"\",\"Luvun pitää olla positiivinen tai nolla!\")","v":""}]
[]
["Laadi sitten arvio yrityksen kulujen määrästä."]
[]
["Muuttuvat kulut:"]
["Millaisiksi arvioit seuraavan vuoden muuttuvat kulut, jotka riippuvat suoraan hevosten määrästä?",null,null,null,null,"Vuodessa:","Liikevaih-dosta, %"]
["Miten paljon kulut karkearehusta ovat hevosta kohti kuukaudessa (euroa / hevonen / kuukausi)?",null,null,null,100,{"$f":"+E70*12*$F$64","v":21600},{"$f":"100*F70/$F$61","v":13.793103448275861},{"$f":"+IF(F70>=0,\"\",\"Luvun pitää olla positiivinen tai nolla!\")","v":""}]
["Miten paljon kulut väkirehusta ovat hevosta kohti kuukaudessa (euroa / hevonen / kuukausi)?",null,null,null,40,{"$f":"+E71*12*$F$64","v":8640},{"$f":"100*F71/$F$61","v":5.5172413793103452},""]
["Miten paljon kulut kivennäisistä ovat hevosta kohti kuukaudessa (euroa / hevonen / kuukausi)?",null,null,null,40,{"$f":"+E72*12*$F$64","v":8640},5.5172413793103452,""]
["Miten paljon muut ruokintakulut ovat hevosta kohti kuukaudessa (euroa / hevonen / kuukausi)?",null,null,null,20,{"$f":"+E73*12*$F$64","v":4320},2.7586206896551726,""]
["Miten paljon kuivikekulut ovat hevosta kohti kuukaudessa (euroa / hevonen / kuukausi)?",null,null,null,50,{"$f":"+E74*12*$F$64","v":10800},6.8965517241379306,""]
["Miten suuriksi arvioit täysihoidon muuttuvat palkat (esim. hoitaja) lisineen hevosta kohti kuukaudessa? (euroa / hevonen / kuukausi) (älä laita tähän talliyrittäjän palkkaa)",null,null,null,100,{"$f":"+F64*E75*12","v":21600},13.793103448275861,""]
["Miten suuriksi arvioit valmennuksen muuttuvat palkat (esim. valmentaja) lisineen hevosta kohti kuukaudessa? (euroa / hevonen / kuukausi) (älä laita tähän talliyrittäjän palkkaa)",null,null,null,300,{"$f":"+F63*E76*12","v":32400},20.689655172413794,""]
["Miten paljon muut muuttuvat kulut (esim. talikot, siivoustarvikkeet) ovat hevosta kohti vuodessa  (euroa / hevonen / vuosi)?",null,null,null,50,{"$f":"+E77*$F$64","v":900},0.57471264367816088,""]
["Seuraavan vuoden ennakoitu myyntikate (liikevaihto - muuttuvat kulut) on:",null,null,null,null,{"$f":"+F61-SUM(F70:F77)","v":47700},{"$f":"100*F78/$F$61","v":30.459770114942529}]
[]
["Kiinteät kulut:",null,null,{"$f":"+IF(B80<0,\" Huom! Luvun pitää olla positiivinen tai nolla!\",\"\")","v":""}]
["Millaisiksi arvioit seuraavan vuoden kiinteät kulut?",null,null,null,null,null,"Liikevaih-dosta, %"]
["Kuinka paljon arvioit vuokrakuluiksi kuukaudessa käyttämistäsi tiloista? (euroa / kuukausi) (jos vuokratiloja)",null,null,null,0,{"$f":"12*E82","v":0},{"$f":"100*F82/$F$61","v":0},{"$f":"+IF(F82>=0,\"\",\"Luvun pitää olla positiivinen tai nolla!\")","v":""}]
["Kuinka paljon arvioit sähkön kulutuksen kuluiksi kuukaudessa? (euroa / kuukausi) ",null,null,null,200,{"$f":"12*E83","v":2400},1.5325670498084292,""]
["Kuinka paljon arvioit veden kulutuksen kuluiksi kuukaudessa? (euroa / kuukausi) ",null,null,null,100,1200,0.76628352490421459,""]
["Kuinka paljon arvioit pohjien huollon kuluiksi kuukaudessa (maneesi ja ratsastuskenttä)? (euroa / kuukausi) ",null,null,null,250,3000,1.9157088122605364,""]
["Kuinka paljon arvioit lantalan tyhjennyksen kuluiksi kuukaudessa? (euroa / kuukausi) ",null,null,null,100,1200,0.76628352490421459,""]
["Kuinka suuriksi arvioit kiinteät palkkakustannukset lisineen (esim. tallityöntekijät, kirjanpitäjä) kuukaudessa? (älä laita tähän talliyrittäjän palkkaa)",null,null,null,2000,24000,15.325670498084291,""]
["Kuinka suuriksi arvioit muut edellä mainitsemattomat kiinteät kulut kuukaudessa? (euroa / kuukausi)",null,null,null,100,1200,0.76628352490421459,""]
["Seuraavan vuoden ennakoitu käyttökate (liikevaihto - muuttuvat kulut - kiinteät kulut) on:",null,null,null,null,{"$f":"+F78-SUM(F82:F88)","v":14700},9.3869731800766285]
[]
["Esittämiesi lukujen perusteella arvioit seuraavan vuoden kuluiksi yhteensä:",null,null,null,null,{"$f":"+SUM(F70:F77)+SUM(F82:F88)","v":141900},90.613026819923377]
[{"$f":"+IF(F92>0,\"Esittämiesi lukujen perusteella liikevaihdon ja muuttuvien kulujen erotus (myyntikate) on:\",\"Muuta antamiasi tietoja, sillä liikevaihdon ja muuttuvien kulujen erotus on negatiivinen:\")","v":"Esittämiesi lukujen perusteella liikevaihdon ja muuttuvien kulujen erotus (myyntikate) on:"},null,null,null,null,{"$f":"+F78","v":47700},30.459770114942529]
[{"$f":"+IF(F93>0,\"Esittämiesi lukujen perusteella liikevaihdon ja  kaikkien kulujen erotus (käyttökate) on:\",\"Muuta antamiasi tietoja, sillä liikevaihdon ja kulujen erotus on negatiivinen:\")","v":"Esittämiesi lukujen perusteella liikevaihdon ja  kaikkien kulujen erotus (käyttökate) on:"},null,null,null,null,{"$f":"+F89","v":14700},9.3869731800766285]
[]
["Mahdolliset uudet (seuraavan vuoden)  investoinnit (pitkäaikaiset sijoitukset) täysihoito/valmennustalliin:"]
["Miten paljon aiot investoida euroissa täysihoito/valmennustalliin seuraavana vuonna?",null,null,null,null,null,"Liikevaih-dosta, %"]
["Miten paljon aiot sijoittaa euroja maa- ja vesialueisiin? (esim. tontin ostamiseen)",null,null,null,null,0,{"$f":"100*F97/$F$61","v":0},{"$f":"+IF(F97>=0,\"\",\"Luvun pitää olla positiivinen tai nolla!\")","v":""}]
["Miten paljon aiot sijoittaa euroja rakennuksiin ja rakennelmiin?  (esim. maneesi, talli, harjoitusravirata, tarhat)",null,null,null,null,20000,12.771392081736909,""]
["Miten paljon aiot sijoittaa euroja koneisiin ja kalustoon  (esim. traktori, lana, pienkuormaaja)?",null,null,null,null,5000,3.1928480204342273,""]
["Miten paljon aiot sijoittaa euroja aineettomaan käyttöomaisuuteen (esim. tietokoneohjelmat)?",null,null,null,null,2000,1.277139208173691,""]
["Miten paljon aiot sijoittaa euroja muuhun käyttöomaisuuteen (esim. työkalut, muu irtaimisto)?",null,null,null,null,500,0.31928480204342274,""]
["Esittämiesi lukujen perusteella sijoitat euroja yrityksesi uuteen omaisuuteen yhteensä:",null,null,null,null,{"$f":"+SUM(F97:F101)","v":27500},17.560664112388249]
[]
["Täyshoito/valmennustallin uusien investointien rahoitus:"]
["Millä tavalla aiot rahoittaa täysihoito/valmennustallin seuraavan toimintavuoden investoinnit?",null,null,null,null,null,"Liikevaih-dosta, %"]
["Miten paljon aiot ottaa lisää lyhytaikaista velkaa toimintaa varten? (euroja)",null,null,{"$f":"+IF(C106<0,\" Huom! Luvun pitää olla positiivinen tai nolla!\",\"\")","v":""},null,2000,{"$f":"100*F106/$F$61","v":1.277139208173691},{"$f":"+IF(F106>=0,\"\",\"Luvun pitää olla positiivinen tai nolla!\")","v":""}]
["Miten paljon aiot ottaa lisää pitkäaikaista velkaa investointien rahoittamista varten? (euroja)",null,null,{"$f":"+IF(C107<0,\" Huom! Luvun pitää olla positiivinen tai nolla!\",\"\")","v":""},null,15000,9.5785440613026829,""]
["Miten paljon aiot sijoittaa toimintaan lisää omaa pääomaa? (euroja)",null,null,null,null,5000,3.1928480204342273,""]
["Esittämiesi lukujen perusteella otat seuraavana vuonna velkaa ja sijoitat omaa pääomaa yritykseesi yhteensä:",null,null,null,null,{"$f":"+SUM(F106:F108)","v":22000},14.048531289910601]
[]
["Sijoittamasi oman pääoman osuus uudesta pääomarahoituksesta on:",null,null,null,null,{"$f":"100*F108/F109","v":22.727272727272727},"%"]
["Sijoitetun uuden oman pääoman ja otetun uuden pitkäaikaisen velan osuus uusien investointien rahoituksesta on:",null,null,null,null,{"$f":"100*(F107+F108)/F102","v":72.727272727272734},"%"]
[]
[]
["MALLIN TUOTTAMAT TILINPÄÄTÖSLASKELMAT VIIDELLE VUODELLE"]
[]
[{"$f":"+T!B3","v":"ENNAKOITU TULOSLASKELMA"}]
[null,{"$f":"+T!C4","v":"Ennakoidut viisi vuotta:"}]
[null,{"$f":"+T!C5","v":1},{"$f":"+T!D5","v":2},{"$f":"+T!E5","v":3},{"$f":"+T!F5","v":4},{"$f":"+T!G5","v":5}]
[{"$f":"+T!B6","v":"Liikevaihto"},{"$f":"+T!C6","v":156600},{"$f":"+T!D6","v":164430},{"$f":"+T!E6","v":172651.5},{"$f":"+T!F6","v":181284.07500000001},{"$f":"+T!G6","v":190348.27875}]
[{"$f":"+T!B7","v":" - Muuttuvat kulut"}]
[{"$f":"+T!B8","v":"Karkearehu"},{"$f":"+T!C8","v":21600},{"$f":"+T!D8","v":22680},{"$f":"+T!E8","v":23814},{"$f":"+T!F8","v":25004.7},{"$f":"+T!G8","v":26254.934999999998}]
[{"$f":"+T!B9","v":"Väkirehu"},{"$f":"+T!C9","v":8640.0000000000018},{"$f":"+T!D9","v":9072.0000000000018},{"$f":"+T!E9","v":9525.6},{"$f":"+T!F9","v":10001.880000000001},{"$f":"+T!G9","v":10501.974}]
[{"$f":"+T!B10","v":"Kivennäiset"},{"$f":"+T!C10","v":8640.0000000000018},{"$f":"+T!D10","v":9072.0000000000018},{"$f":"+T!E10","v":9525.6},{"$f":"+T!F10","v":10001.880000000001},{"$f":"+T!G10","v":10501.974}]
[{"$f":"+T!B11","v":"Muut ruokintakustannukset"},{"$f":"+T!C11","v":4320.0000000000009},{"$f":"+T!D11","v":4536.0000000000009},{"$f":"+T!E11","v":4762.8},{"$f":"+T!F11","v":5000.9400000000005},{"$f":"+T!G11","v":5250.9870000000001}]
[{"$f":"+T!B12","v":"Kuivikekustannukset"},{"$f":"+T!C12","v":10800},{"$f":"+T!D12","v":11340},{"$f":"+T!E12","v":11907},{"$f":"+T!F12","v":12502.35},{"$f":"+T!G12","v":13127.467499999999}]
[{"$f":"+T!B13","v":"Täyshoidon muuttuvat palkat lisineen"},{"$f":"+T!C13","v":21600},{"$f":"+T!D13","v":22680},{"$f":"+T!E13","v":23814},{"$f":"+T!F13","v":25004.7},{"$f":"+T!G13","v":26254.934999999998}]
[{"$f":"+T!B14","v":"Valmennuksen muuttuvat palkat lisineen"},{"$f":"+T!C14","v":32400},{"$f":"+T!D14","v":34020},{"$f":"+T!E14","v":35721},{"$f":"+T!F14","v":37507.050000000003},{"$f":"+T!G14","v":39382.402499999997}]
[{"$f":"+T!B15","v":"Muut muuttuvat kulut"},{"$f":"+T!C15","v":900},{"$f":"+T!D15","v":945},{"$f":"+T!E15","v":992.25},{"$f":"+T!F15","v":1041.8625},{"$f":"+T!G15","v":1093.9556250000001}]
[{"$f":"+T!B16","v":" = Myyntikate"},{"$f":"+T!C16","v":47700},{"$f":"+T!D16","v":50085},{"$f":"+T!E16","v":52589.25},{"$f":"+T!F16","v":55218.712499999994},{"$f":"+T!G16","v":57979.648125000007}]
[{"$f":"+T!B17","v":" - Kiinteät kulut"}]
[{"$f":"+T!B18","v":"Vuokrakulut"},{"$f":"+T!C18","v":0},{"$f":"+T!D18","v":0},{"$f":"+T!E18","v":0},{"$f":"+T!F18","v":0},{"$f":"+T!G18","v":0}]
[{"$f":"+T!B19","v":"Sähkökulut"},{"$f":"+T!C19","v":2400},{"$f":"+T!D19","v":2472},{"$f":"+T!E19","v":2546.16},{"$f":"+T!F19","v":2622.5448000000001},{"$f":"+T!G19","v":2701.2211439999996}]
[{"$f":"+T!B20","v":"Vesikulut"},{"$f":"+T!C20","v":1200},{"$f":"+T!D20","v":1236},{"$f":"+T!E20","v":1273.08},{"$f":"+T!F20","v":1311.2724000000001},{"$f":"+T!G20","v":1350.6105719999998}]
[{"$f":"+T!B21","v":"Pohjien huolto"},{"$f":"+T!C21","v":3000},{"$f":"+T!D21","v":3090},{"$f":"+T!E21","v":3182.7},{"$f":"+T!F21","v":3278.181},{"$f":"+T!G21","v":3376.5264299999999}]
[{"$f":"+T!B22","v":"Lantalan tyhjennys"},{"$f":"+T!C22","v":1200},{"$f":"+T!D22","v":1236},{"$f":"+T!E22","v":1273.08},{"$f":"+T!F22","v":1311.2724000000001},{"$f":"+T!G22","v":1350.6105719999998}]
[{"$f":"+T!B23","v":"Kiinteät palkkakustannukset lisineen"},{"$f":"+T!C23","v":24000},{"$f":"+T!D23","v":24720},{"$f":"+T!E23","v":25461.599999999999},{"$f":"+T!F23","v":26225.448},{"$f":"+T!G23","v":27012.211439999999}]
[{"$f":"+T!B25","v":" = Käyttökate"},{"$f":"+T!C25","v":14700},{"$f":"+T!D25","v":16095},{"$f":"+T!E25","v":17579.550000000003},{"$f":"+T!F25","v":19158.721499999992},{"$f":"+T!G25","v":20837.857395000006}]
[{"$f":"+T!B26","v":" - Poistot"}]
[{"$f":"+T!B27","v":"Maa- ja vesialueet"},{"$f":"+T!C27","v":0},{"$f":"+T!D27","v":0},{"$f":"+T!E27","v":0},{"$f":"+T!F27","v":0},{"$f":"+T!G27","v":0}]
[{"$f":"+T!B28","v":"Rakennukset ja rakennelmat"},{"$f":"+T!C28","v":5714.2857142857247},{"$f":"+T!D28","v":5442.1768707482988},{"$f":"+T!E28","v":5183.0255911888671},{"$f":"+T!F28","v":4936.2148487512895},{"$f":"+T!G28","v":4701.1569988107658}]
[{"$f":"+T!B29","v":"Koneet ja kalusto"},{"$f":"+T!C29","v":5000},{"$f":"+T!D29","v":4375},{"$f":"+T!E29","v":3828.125},{"$f":"+T!F29","v":3349.609375},{"$f":"+T!G29","v":2930.908203125}]
[{"$f":"+T!B30","v":"Aineeton käyttöomaisuus"},{"$f":"+T!C30","v":600},{"$f":"+T!D30","v":480},{"$f":"+T!E30","v":384},{"$f":"+T!F30","v":307.19999999999982},{"$f":"+T!G30","v":245.76}]
[{"$f":"+T!B31","v":"Muu käyttöomaisuus"},{"$f":"+T!C31","v":300},{"$f":"+T!D31","v":240},{"$f":"+T!E31","v":192},{"$f":"+T!F31","v":153.59999999999991},{"$f":"+T!G31","v":122.88}]
[{"$f":"+T!B32","v":" = Liiketulos"},{"$f":"+T!C32","v":3085.7142857142753},{"$f":"+T!D32","v":5557.8231292517012},{"$f":"+T!E32","v":7992.3994088111358},{"$f":"+T!F32","v":10412.097276248702},{"$f":"+T!G32","v":12837.152193064241}]
[{"$f":"+T!B33","v":" - Korkokulut"},{"$f":"+T!C33","v":3260},{"$f":"+T!D33","v":3534.2},{"$f":"+T!E33","v":3413.8763102040812},{"$f":"+T!F33","v":3229.1332287140913},{"$f":"+T!G33","v":2983.6496336606829}]
[{"$f":"+T!B34","v":" - Verot"},{"$f":"+T!C34","v":0},{"$f":"+T!D34","v":404.72462585034032},{"$f":"+T!E34","v":915.70461972141095},{"$f":"+T!F34","v":1436.5928095069221},{"$f":"+T!G34","v":1970.7005118807117}]
[{"$f":"+T!B35","v":"Tilikauden tulos"},{"$f":"+T!C35","v":-174.28571428572468},{"$f":"+T!D35","v":1618.8985034013613},{"$f":"+T!E35","v":3662.8184788856433},{"$f":"+T!F35","v":5746.3712380276884},{"$f":"+T!G35","v":7882.8020475228468}]
[]
[{"$f":"+T!B37","v":"ENNAKOITU TASE"}]
[null,{"$f":"+T!C38","v":"Ennakoidut viisi vuotta:"}]
[null,{"$f":"+T!C39","v":1},{"$f":"+T!D39","v":2},{"$f":"+T!E39","v":3},{"$f":"+T!F39","v":4},{"$f":"+T!G39","v":5}]
[{"$f":"+T!B40","v":"Taseen omaisuus"}]
[{"$f":"+T!B41","v":"Lyhytaikainen:"}]
[{"$f":"+T!B42","v":"Rahoitusomaisuus ja muu lyhytaikainen omaisuus"},{"$f":"+T!C42","v":7830},{"$f":"+T!D42","v":8221.5},{"$f":"+T!E42","v":8632.5750000000007},{"$f":"+T!F42","v":9064.2037500000006},{"$f":"+T!G42","v":10217.891238058461}]
[{"$f":"+T!B43","v":"Pitkäaikainen:"}]
[{"$f":"+T!B44","v":"Maa- ja vesialueet"},{"$f":"+T!C44","v":20000},{"$f":"+T!D44","v":20000},{"$f":"+T!E44","v":20000},{"$f":"+T!F44","v":20000},{"$f":"+T!G44","v":20000}]
[{"$f":"+T!B45","v":"Rakennukset ja rakennelmat"},{"$f":"+T!C45","v":114285.71428571428},{"$f":"+T!D45","v":108843.53741496598},{"$f":"+T!E45","v":103660.51182377711},{"$f":"+T!F45","v":98724.29697502582},{"$f":"+T!G45","v":94023.139976215054}]
[{"$f":"+T!B46","v":"Koneet ja kalusto"},{"$f":"+T!C46","v":35000},{"$f":"+T!D46","v":30625},{"$f":"+T!E46","v":26796.875},{"$f":"+T!F46","v":23447.265625},{"$f":"+T!G46","v":20516.357421875}]
[{"$f":"+T!B47","v":"Aineeton käyttöomaisuus"},{"$f":"+T!C47","v":2400},{"$f":"+T!D47","v":1920},{"$f":"+T!E47","v":1536},{"$f":"+T!F47","v":1228.8000000000002},{"$f":"+T!G47","v":983.04000000000019}]
[{"$f":"+T!B48","v":"Muu käyttöomaisuus"},{"$f":"+T!C48","v":1200},{"$f":"+T!D48","v":960},{"$f":"+T!E48","v":768},{"$f":"+T!F48","v":614.40000000000009},{"$f":"+T!G48","v":491.5200000000001}]
[{"$f":"+T!B49","v":"Yhteensä"},{"$f":"+T!C49","v":180715.71428571426},{"$f":"+T!D49","v":170570.03741496598},{"$f":"+T!E49","v":161393.96182377712},{"$f":"+T!F49","v":153078.96635002579},{"$f":"+T!G49","v":146231.9486361485}]
[]
[{"$f":"+T!B51","v":"Taseen pääoma"}]
[{"$f":"+T!B52","v":"Lyhytaikainen:"}]
[{"$f":"+T!B53","v":"Lyhytaikaiset velat (maks. voitto-osuus)"},{"$f":"+T!C53","v":91.285714285713766},{"$f":"+T!D53","v":167.66635374149615},{"$f":"+T!E53","v":342.42395999870354},{"$f":"+T!F53","v":612.62132390015279},{"$f":"+T!G53","v":976.13036008128756}]
[{"$f":"+T!B54","v":"Muu lyhytaikainen vieras pääoma"},{"$f":"+T!C54","v":25640},{"$f":"+T!D54","v":36954.210340136051},{"$f":"+T!E54","v":43822.357623803036},{"$f":"+T!F54","v":46711.88362202276},{"$f":"+T!G54","v":46711.88362202276}]
[{"$f":"+T!B55","v":"Pitkäaikainen:"}]
[{"$f":"+T!B56","v":"Pitkäaikainen vieras pääoma"},{"$f":"+T!C56","v":138250},{"$f":"+T!D56","v":115262.5},{"$f":"+T!E56","v":95723.125},{"$f":"+T!F56","v":79114.65625},{"$f":"+T!G56","v":64997.457812499997}]
[{"$f":"+T!B57","v":"Sijoitettu oma pääoma"},{"$f":"+T!C57","v":15000},{"$f":"+T!D57","v":15000},{"$f":"+T!E57","v":15000},{"$f":"+T!F57","v":15000},{"$f":"+T!G57","v":15000}]
[{"$f":"+T!B58","v":"Kertyneet voittovarat ja muu oma pääoma"},{"$f":"+T!C58","v":1734.4285714285616},{"$f":"+T!D58","v":3185.6607210884267},{"$f":"+T!E58","v":6506.0552399753669},{"$f":"+T!F58","v":11639.805154102902},{"$f":"+T!G58","v":18546.476841544463}]
[{"$f":"+T!B59","v":"Yhteensä"},{"$f":"+T!C59","v":180715.71428571426},{"$f":"+T!D59","v":170570.03741496598},{"$f":"+T!E59","v":161393.96182377709},{"$f":"+T!F59","v":153078.96635002582},{"$f":"+T!G59","v":146231.9486361485}]
[]
[{"$f":"+T!B61","v":"ENNAKOIDUT TUNNUSLUVUT"}]
[null,{"$f":"+T!C62","v":"Ennakoidut viisi vuotta:"}]
[null,{"$f":"+T!C63","v":1},{"$f":"+T!D63","v":2},{"$f":"+T!E63","v":3},{"$f":"+T!F63","v":4},{"$f":"+T!G63","v":5}]
[{"$f":"+T!B64","v":"Koko"}]
[{"$f":"+T!B65","v":"1. Liikevaihto (Euro)"},{"$f":"+T!C65","v":156600},{"$f":"+T!D65","v":164430},{"$f":"+T!E65","v":172651.5},{"$f":"+T!F65","v":181284.07500000001},{"$f":"+T!G65","v":190348.27875}]
[{"$f":"+T!B66","v":"2. Taseen loppusumma (Euro)"},{"$f":"+T!C66","v":180715.71428571426},{"$f":"+T!D66","v":170570.03741496598},{"$f":"+T!E66","v":161393.96182377712},{"$f":"+T!F66","v":153078.96635002579},{"$f":"+T!G66","v":146231.9486361485}]
[{"$f":"+T!B67","v":"3. Tilikauden tulos (Euro)"},{"$f":"+T!C67","v":-174.28571428572468},{"$f":"+T!D67","v":1618.8985034013613},{"$f":"+T!E67","v":3662.8184788856433},{"$f":"+T!F67","v":5746.3712380276884},{"$f":"+T!G67","v":7882.8020475228468}]
[{"$f":"+T!B68","v":"4. Voitto-osuus omistajalle (Euro)"},{"$f":"+T!C68","v":91.285714285713766},{"$f":"+T!D68","v":167.66635374149615},{"$f":"+T!E68","v":342.42395999870354},{"$f":"+T!F68","v":612.62132390015279},{"$f":"+T!G68","v":976.13036008128756}]
[]
[{"$f":"+T!B70","v":"Kasvu"}]
[{"$f":"+T!B71","v":"1. Liikevaihdon kasvu-%"},null,{"$f":"+T!D71","v":5},{"$f":"+T!E71","v":5},{"$f":"+T!F71","v":5},{"$f":"+T!G71","v":5}]
[{"$f":"+T!B72","v":"2. Taseen loppusumman kasvu-%"},null,{"$f":"+T!D72","v":-5.6141641643337294},{"$f":"+T!E72","v":-5.3796526812414953},{"$f":"+T!F72","v":-5.1519867161017459},{"$f":"+T!G72","v":-4.4728664408545171}]
[{"$f":"+T!B73","v":"3. Tilikauden tuloksen kasvu-%"},null,{"$f":"+T!D73","v":-1028.8761904761354},{"$f":"+T!E73","v":126.25374420878987},{"$f":"+T!F73","v":56.88386610345853},{"$f":"+T!G73","v":37.178781547508237}]
[]
[{"$f":"+T!B75","v":"Kannattavuus"}]
[{"$f":"+T!B76","v":"1. Käyttökate / Liikevaihto (%)"},{"$f":"+T!C76","v":9.3869731800766285},{"$f":"+T!D76","v":9.7883597883597879},{"$f":"+T!E76","v":10.182100937437557},{"$f":"+T!F76","v":10.56834225510431},{"$f":"+T!G76","v":10.947226595291713}]
[{"$f":"+T!B77","v":"2. Liiketulos / Liikevaihto (%)"},{"$f":"+T!C77","v":1.970443349753688},{"$f":"+T!D77","v":3.380054204981878},{"$f":"+T!E77","v":4.6292093661573377},{"$f":"+T!F77","v":5.7435256109775228},{"$f":"+T!G77","v":6.7440337666117403}]
[{"$f":"+T!B78","v":"3. Tilikauden tulos / Liikevaihto (%)"},{"$f":"+T!C78","v":-0.11129355956942828},{"$f":"+T!D78","v":0.98455178702266088},{"$f":"+T!E78","v":2.1215097922031627},{"$f":"+T!F78","v":3.169815792163591},{"$f":"+T!G78","v":4.141252077133819}]
[{"$f":"+T!B79","v":"4. Sijoitetun pääoman tuotto-%"},null,{"$f":"+T!D79","v":3.0754509375231751},{"$f":"+T!E79","v":4.6856995108508279},{"$f":"+T!F79","v":6.4513549073276142},{"$f":"+T!G79","v":8.385967386081763}]
[{"$f":"+T!B80","v":"5. Oman pääoman tuotto-%"},null,{"$f":"+T!D80","v":9.6740590602859253},{"$f":"+T!E80","v":20.141244990005625},{"$f":"+T!F80","v":26.71978274912248},{"$f":"+T!G80","v":29.590314200585606}]
[]
[{"$f":"+T!B82","v":"Maksuvalmius"}]
[{"$f":"+T!B83","v":"1. Rahoitustulos / Liikevaihto"},{"$f":"+T!C83","v":7.3052362707535119},{"$f":"+T!D83","v":7.3928573704005709},{"$f":"+T!E83","v":7.6744013634833808},{"$f":"+T!F83","v":7.9946324362903791},{"$f":"+T!G83","v":8.3444449058137931}]
[{"$f":"+T!B84","v":"2. Quick ratio"},{"$f":"+T!C84","v":0.30429882466591529},{"$f":"+T!D84","v":0.22147317787292686},{"$f":"+T!E84","v":0.19546287087642156},{"$f":"+T!F84","v":0.1915329861423283},{"$f":"+T!G84","v":0.21426539679117154}]
[]
[{"$f":"+T!B86","v":"Vakavaraisuus"}]
[{"$f":"+T!B87","v":"1. Omavaraisuusaste"},{"$f":"+T!C87","v":9.2600849005146166},{"$f":"+T!D87","v":10.66169709328609},{"$f":"+T!E87","v":13.325191969360914},{"$f":"+T!F87","v":17.402655498201572},{"$f":"+T!G87","v":22.940593457462676}]
[{"$f":"+T!B88","v":"2. Rahoitustulos / Velat (%)"},{"$f":"+T!C88","v":6.9764058442209},{"$f":"+T!D88","v":7.9772451992042459},{"$f":"+T!E88","v":9.471847419588725},{"$f":"+T!F88","v":11.462426138149921},{"$f":"+T!G88","v":14.095434838672075}]
[]
[{"$f":"+T!B90","v":"Rahoitusriski: Taipumus kuulua konkurssiyritysten (1) tai toimivien yritysten (0) joukkoon"}]
[{"$f":"+T!B91","v":"1. Kolmen muuttujan P-luku "},{"$f":"+T!C91","v":0.62435104159514776},{"$f":"+T!D91","v":0.61599142285351272},{"$f":"+T!E91","v":0.59841199008606749},{"$f":"+T!F91","v":0.57094608368129884},{"$f":"+T!G91","v":0.53290317502239071}]
[]
[]
[{"$f":"+T!B94","v":"TULKINTARAPORTTI"}]
[]
[null,{"$f":"+T!C96","v":"Ennakoidut viisi vuotta:"}]
[null,{"$f":"+T!C97","v":1},{"$f":"+T!D97","v":2},{"$f":"+T!E97","v":3},{"$f":"+T!F97","v":4},{"$f":"+T!G97","v":5}]
[{"$f":"+T!B98","v":"Kannattavuus"}]
[{"$f":"+T!B99","v":"Käyttökate / Myyntituotot (%)"},{"$f":"+T!C99","v":"Positiivinen"},{"$f":"+T!D99","v":"Positiivinen"},{"$f":"+T!E99","v":"Positiivinen"},{"$f":"+T!F99","v":"Positiivinen"},{"$f":"+T!G99","v":"Positiivinen"}]
[{"$f":"+T!B100","v":"Sijoitetun pääoman tuotto-%"},null,{"$f":"+T!D100","v":"Välttävä"},{"$f":"+T!E100","v":"Välttävä"},{"$f":"+T!F100","v":"Tyydyttävä"},{"$f":"+T!G100","v":"Tyydyttävä"}]
[{"$f":"+T!B101","v":"Oman pääoman tuotto-%"},null,{"$f":"+T!D101","v":"Välttävä"},{"$f":"+T!E101","v":"Erinomainen"},{"$f":"+T!F101","v":"Erinomainen"},{"$f":"+T!G101","v":"Erinomainen"}]
[]
[{"$f":"+T!B103","v":"Maksuvalmius"}]
[{"$f":"+T!B104","v":"Rahoitustulos / Myyntituotot"},{"$f":"+T!C104","v":"Positiivinen"},{"$f":"+T!D104","v":"Positiivinen"},{"$f":"+T!E104","v":"Positiivinen"},{"$f":"+T!F104","v":"Positiivinen"},{"$f":"+T!G104","v":"Positiivinen"}]
[{"$f":"+T!B105","v":"Quick ratio"},{"$f":"+T!C105","v":"Välttävä"},{"$f":"+T!D105","v":"Heikko"},{"$f":"+T!E105","v":"Heikko"},{"$f":"+T!F105","v":"Heikko"},{"$f":"+T!G105","v":"Heikko"}]
[]
[{"$f":"+T!B107","v":"Vakavaraisuus"}]
[{"$f":"+T!B108","v":"Omavaraisuusaste"},{"$f":"+T!C108","v":"Heikko"},{"$f":"+T!D108","v":"Heikko"},{"$f":"+T!E108","v":"Heikko"},{"$f":"+T!F108","v":"Välttävä"},{"$f":"+T!G108","v":"Välttävä"}]
[{"$f":"+T!B109","v":"Rahoitustulos / Velat (%)"},{"$f":"+T!C109","v":"Heikko"},{"$f":"+T!D109","v":"Heikko"},{"$f":"+T!E109","v":"Heikko"},{"$f":"+T!F109","v":"Välttävä"},{"$f":"+T!G109","v":"Välttävä"}]
[]
[{"$f":"+T!B111","v":"Rahoitusriski"}]
[{"$f":"+T!B112","v":"Kolmen muuttujan P-luku"},{"$f":"+T!C112","v":"Suuri riski"},{"$f":"+T!D112","v":"Suuri riski"},{"$f":"+T!E112","v":"Suuri riski"},{"$f":"+T!F112","v":"Suuri riski"},{"$f":"+T!G112","v":"Suuri riski"}]
[]
[{"$f":"+T!B115","v":"LIITEKUVIOT"}]
[]
[]
[]
[]
[]
[]
[]
[]
[]
[]
[]
[]
[]
[]
[]
[]
[]
[]
[]
[]
[]
[]
[]
[]
[]
[]
[]
[]
[]
[]
[]
[]
[]
[]
[]
[]
[]
[]
[]
[]
[]
[]
[]
[]
[]
[]
[]
[]
[]
[]
[]
[]
[]
[]
[]
[]
[]
[]
[]
[]
[]
[]
[]
[]
[]
[]
[]
[]
[]
[]
[]
["Tämä raportti on suuntaa-antava laskelma siitä, miten täysihoito/valmennustallisi voisi antamillasi lähtötiedoilla taloudellisesti menestyä viiden seuraavan vuoden aikana. Tehdyt laskelmat perustuvat omiin arvioihisi esimerkiksi yrityksesi kasvusta ja velkojen korkokannoista. Laskelmissa ei ole huomioitu erikseen arvonlisäveroa. Vastuu laskelmien hyödyntämisestä on ohjelman käyttäjällä. Copyright Vaasan Yritysinformaatio Oy."]

{"sheet":"E","index":1,"n_rows":168,"n_cols":8,"rows_kept":168,"cut":false,"hidden":true,"merged":[]}
[1,{"$f":"+A1+1","v":2},{"$f":"+B1+1","v":3},4,5,6,7,8]
[" Copyright Vaasan Yritysinformaatio Oy. Kaikki tekijänoikeudet pidätetään."]
["TOIMIVAN RATSASTUSKOULUN TILINPÄÄTÖSENNUSTE VIIDELLE VUODELLE"]
[]
["LIIKEVAIHDON KASVUENNUSTE"]
[null,"Lähtöoletus:",null,"Vuodet:"]
[null,null,null,1,2,3,4,5]
["Ensimmäisen vuoden liikevaihto",{"$f":"+K!F61","v":156600},null,{"$f":"+$B$8*(1+$B$9)^(D$7-1)","v":156600},{"$f":"+$B$8*(1+$B$9)^(E$7-1)","v":164430},172651.5,181284.07500000001,190348.27875]
["Liikevaihdon arvioitu kasvuvauhti",{"$f":"+K!G48","v":0.05}]
["Kiinteiden kulujen arvioitu kasvuvauhti",{"$f":"+K!G49","v":0.03}]
[]
[]
["Verokanta",{"$f":"+K!G42","v":0.2}]
["Lyhytaikaisen vieraan pääoman korko-%",{"$f":"+K!G43","v":0.03}]
["Pitkäaikaisen vieraan pääoman korko-%",{"$f":"+K!G44","v":0.02}]
["Voitto-osuus-%  kertyneistä voitoista",{"$f":"+K!G46","v":0.05}]
["Pitkäaikaisen velan lyhennysosuus (%)",{"$f":"+K!G45","v":0.15}]
["Rahoitusomaisuus / Liikevaihto",{"$f":"+K!G47","v":0.05},"Minimitaso","Toimivien yritysten keskiarvo"]
["Vaihto-omaisuus / Liikevaihto",0,"Taso"]
["Myyntisaamisten kasvu-%",0]
["Ostovelkojen kasvu-%",0]
[]
["KASSAVIRTAENNUSTE (Euro)"]
[]
[null,null,null,{"$f":"+D7","v":1},{"$f":"+D25+1","v":2},{"$f":"+E25+1","v":3},4,5]
["Liikevaihto","%-osuus",null,{"$f":"+D8","v":156600},{"$f":"+E8","v":164430},{"$f":"+F8","v":172651.5},{"$f":"+G8","v":181284.07500000001},{"$f":"+H8","v":190348.27875}]
[" - Muuttuvat kulut"]
["Karkearehu",{"$f":"+K!G70/100","v":0.13793103448275862},null,{"$f":"+$B28*D$26","v":21600},22680,23814,25004.7,26254.934999999998]
["Väkirehu",{"$f":"+K!G71/100","v":5.5172413793103454E-2},null,8640.0000000000018,9072.0000000000018,9525.6,10001.880000000001,10501.974]
["Kivennäiset",{"$f":"+K!G72/100","v":5.5172413793103454E-2},null,8640.0000000000018,9072.0000000000018,9525.6,10001.880000000001,10501.974]
["Muut ruokintakustannukset",{"$f":"+K!G73/100","v":2.7586206896551727E-2},null,4320.0000000000009,4536.0000000000009,4762.8,5000.9400000000005,5250.9870000000001]
["Kuivikekustannukset",{"$f":"+K!G74/100","v":6.8965517241379309E-2},null,10800,11340,11907,12502.35,13127.467499999999]
["Täyshoidon muuttuvat palkat lisineen",{"$f":"+K!G75/100","v":0.13793103448275862},null,21600,22680,23814,25004.7,26254.934999999998]
["Valmennuksen muuttuvat palkat lisineen",{"$f":"+K!G76/100","v":0.20689655172413793},null,32400,34020,35721,37507.050000000003,39382.402499999997]
["Muut muuttuvat kulut",{"$f":"+K!G77/100","v":5.7471264367816091E-3},null,900,945,992.25,1041.8625,1093.9556250000001]
[" = Myyntikate (menopohjainen)",{"$f":"+K!G78/100","v":0.3045977011494253},null,{"$f":"+D26-SUM(D28:D35)","v":47700},{"$f":"+E26-SUM(E28:E35)","v":50085},{"$f":"+F26-SUM(F28:F35)","v":52589.25},{"$f":"+G26-SUM(G28:G35)","v":55218.712499999994},{"$f":"+H26-SUM(H28:H35)","v":57979.648125000007}]
[" - Kiinteät kulut"]
["Vuokrakulut",{"$f":"+K!F82","v":0},null,{"$f":"+$B38*(1+$B$10)^(D$25-1)","v":0},0,0,0,0]
["Sähkökulut",{"$f":"+K!F83","v":2400},null,2400,2472,2546.16,2622.5448000000001,2701.2211439999996]
["Vesikulut",{"$f":"+K!F84","v":1200},null,1200,1236,1273.08,1311.2724000000001,1350.6105719999998]
["Pohjien huolto",{"$f":"+K!F85","v":3000},null,3000,3090,3182.7,3278.181,3376.5264299999999]
["Lantalan tyhjennys",{"$f":"+K!F86","v":1200},null,1200,1236,1273.08,1311.2724000000001,1350.6105719999998]
["Kiinteät palkkakustannukset lisineen",{"$f":"+K!F87","v":24000},null,24000,24720,25461.599999999999,26225.448,27012.211439999999]
["Muut kiinteät kulut",{"$f":"+K!F88","v":1200},null,1200,1236,1273.08,1311.2724000000001,1350.6105719999998]
[" = Käyttökate (menopohjainen)",null,null,{"$f":"+D36-SUM(D38:D44)","v":14700},{"$f":"+E36-SUM(E38:E44)","v":16095},17579.550000000003,19158.721499999992,20837.857395000006]
["Korkomenot","automaatti",null,{"$f":"+$B$14*C$125+$B$15*C$127","v":3260},{"$f":"+$B$14*D$125+$B$15*D$127","v":3534.2},{"$f":"+$B$14*E$125+$B$15*E$127","v":3413.8763102040812},{"$f":"+$B$14*F$125+$B$15*F$127","v":3229.1332287140913},{"$f":"+$B$14*G$125+$B$15*G$127","v":2983.6496336606829}]
["Verot","automaatti",null,{"$f":"+D106","v":0},{"$f":"+E106","v":404.72462585034032},{"$f":"+F106","v":915.70461972141095},{"$f":"+G106","v":1436.5928095069221},{"$f":"+H106","v":1970.7005118807117}]
["Osingot","automaatti",null,0,{"$f":"+D133","v":91.285714285713766},{"$f":"+E133","v":167.66635374149615},{"$f":"+F133","v":342.42395999870354},{"$f":"+G133","v":612.62132390015279}]
[" = Rahoitustulos (menopohjainen)",null,null,{"$f":"+D45-SUM(D46:D48)","v":11440},{"$f":"+E45-SUM(E46:E48)","v":12064.789659863945},13082.302716333015,14150.571501780276,15270.885925558459]
[" - Investoinnit"]
["Maa- ja vesialueet",{"$f":"+K!F97","v":0},{"$f":"+B51","v":0},{"$f":"+B51","v":0},0,0,0,0]
["Rakennukset ja rakennelmat",{"$f":"+K!F98","v":20000},{"$f":"+B52","v":20000},{"$f":"+B52","v":20000},0,0,0,0]
["Koneet ja kalusto",{"$f":"+K!F99","v":5000},5000,5000,0,0,0,0]
["Aineeton käyttöomaisuus",{"$f":"+K!F100","v":2000},2000,2000,0,0,0,0]
["Muu käyttöomaisuus",{"$f":"+K!F101","v":500},500,500,0,0,0,0]
[" - Kassavirtamuunnos"]
[" = Investointijäämä",null,null,{"$f":"+D49-SUM(D51:D56)","v":-16060},{"$f":"+E49-SUM(E51:E56)","v":12064.789659863945},{"$f":"+F49-SUM(F51:F56)","v":13082.302716333015},{"$f":"+G49-SUM(G51:G56)","v":14150.571501780276},{"$f":"+H49-SUM(H51:H56)","v":15270.885925558459}]
[" + Muun rahoitusomaisuuden vähennys","automaatti",null,{"$f":"-$B$18*D$78+C113","v":2170},{"$f":"-$B$18*E$78+D113","v":-391.5},{"$f":"-$B$18*F$78+E113","v":-411.07500000000073},{"$f":"-$B$18*G$78+F113","v":-431.62874999999985},{"$f":"-$B$18*H$78+G113","v":-453.21018749999894}]
[" + Muun lyhytaikaisen vieraan pääoman lisäys",{"$f":"+K!F106","v":2000},null,{"$f":"+K!F106","v":2000},0,0,0,0]
[" + Pitkäaikaisen vieraan pääoman lisäys",{"$f":"+K!F107","v":15000},{"$f":"+K!F31","v":145000},{"$f":"+B60-$B$17*C60","v":-6750},{"$f":"-SUM($B60:D60)*$B$17","v":-22987.5},{"$f":"-SUM($B60:E60)*$B$17","v":-19539.375},{"$f":"-SUM($B60:F60)*$B$17","v":-16608.46875},{"$f":"-SUM($B60:G60)*$B$17","v":-14117.198437499999}]
[" + Oman pääoman lisäys",{"$f":"+K!F108","v":5000},null,{"$f":"+K!F108","v":5000},0,0,0,0]
[" - Rahoitusomaisuuden lisäys (tasoitus)","automaatti",null,{"$f":"+IF(SUM(D57:D61)>0,-SUM(D57:D61),0)","v":0},{"$f":"+IF(SUM(E57:E61)>0,-SUM(E57:E61),0)","v":0},0,0,-700.47730055846114]
[" = Netto rahoituksen jälkeen (0)",null,null,{"$f":"+SUM(D57:D62)","v":-13640},{"$f":"+SUM(E57:E62)","v":-11314.210340136055},{"$f":"+SUM(F57:F62)","v":-6868.1472836669855},{"$f":"+SUM(G57:G62)","v":-2889.525998219724},{"$f":"+SUM(H57:H62)","v":0}]
[null,null,null,{"$f":"+IF(D63=0,\" \",\"Huom! Ei 0\")","v":"Huom! Ei 0"},{"$f":"+IF(E63=0,\" \",\"Huom! Ei 0\")","v":"Huom! Ei 0"},"Huom! Ei 0","Huom! Ei 0"," "]
[null,null,null,"Lyhytaikaisen velan"]
[null,null,null,"lisäykseen"]
[]
["Poistot:","Käyttöomaisuus","Poisto-%","Poisto"]
[{"$f":"+A51","v":"Maa- ja vesialueet"},{"$f":"+K!F20+K!F97","v":20000},{"$f":"+IF(K!F20=0,0,+K!G20/(K!F20+K!G20))","v":0},{"$f":"+C69*B69","v":0}]
[{"$f":"+A52","v":"Rakennukset ja rakennelmat"},{"$f":"+K!F21+K!F98","v":120000},{"$f":"+IF(K!F21=0,0,+K!G21/(K!F21+K!G21))","v":4.7619047619047616E-2},{"$f":"+C70*B70","v":5714.2857142857138}]
[{"$f":"+A53","v":"Koneet ja kalusto"},{"$f":"+K!F22+K!F99","v":40000},{"$f":"+IF(K!F22=0,0,+K!G22/(K!F22+K!G22))","v":0.125},5000]
["Aineeton käyttöomaisuus",{"$f":"+K!F23+K!F100","v":3000},{"$f":"+IF(K!F23=0,0,+K!G23/(K!F23+K!G23))","v":0.2},600]
[{"$f":"+A55","v":"Muu käyttöomaisuus"},{"$f":"+K!F24+K!F101","v":1500},{"$f":"+IF(K!F24=0,0,+K!G24/(K!F24+K!G24))","v":0.2},300]
[]
["TULOSLASKELMAENNUSTE (Euro)"]
[null,null,null,"Ennusteet:"]
[null,null,null,{"$f":"+D25","v":1},2,3,4,5]
["Liikevaihto",null,null,156600,164430,172651.5,181284.07500000001,190348.27875]
[" - Muuttuvat kulut"]
["Karkearehu",null,null,{"$f":"+D28","v":21600},22680,23814,25004.7,26254.934999999998]
["Väkirehu",null,null,8640.0000000000018,9072.0000000000018,9525.6,10001.880000000001,10501.974]
["Kivennäiset",null,null,8640.0000000000018,9072.0000000000018,9525.6,10001.880000000001,10501.974]
["Muut ruokintakustannukset",null,null,4320.0000000000009,4536.0000000000009,4762.8,5000.9400000000005,5250.9870000000001]
["Kuivikekustannukset",null,null,10800,11340,11907,12502.35,13127.467499999999]
["Täyshoidon muuttuvat palkat lisineen",null,null,21600,22680,23814,25004.7,26254.934999999998]
["Valmennuksen muuttuvat palkat lisineen",null,null,32400,34020,35721,37507.050000000003,39382.402499999997]
["Muut muuttuvat kulut",null,null,900,945,992.25,1041.8625,1093.9556250000001]
[" = Myyntikate",null,null,{"$f":"+D78-SUM(D80:D87)","v":47700},{"$f":"+E78-SUM(E80:E87)","v":50085},{"$f":"+F78-SUM(F80:F87)","v":52589.25},{"$f":"+G78-SUM(G80:G87)","v":55218.712499999994},{"$f":"+H78-SUM(H80:H87)","v":57979.648125000007}]
[" - Kiinteät kulut"]
["Vuokrakulut",null,null,{"$f":"+D38","v":0},0,0,0,0]
["Sähkökulut",null,null,2400,2472,2546.16,2622.5448000000001,2701.2211439999996]
["Vesikulut",null,null,1200,1236,1273.08,1311.2724000000001,1350.6105719999998]
["Pohjien huolto",null,null,3000,3090,3182.7,3278.181,3376.5264299999999]
["Lantalan tyhjennys",null,null,1200,1236,1273.08,1311.2724000000001,1350.6105719999998]
["Kiinteät palkkakustannukset lisineen",null,null,24000,24720,25461.599999999999,26225.448,27012.211439999999]
["Muut kiinteät kulut",null,null,1200,1236,1273.08,1311.2724000000001,1350.6105719999998]
[" = Käyttökate",null,null,{"$f":"+D88-SUM(D90:D96)","v":14700},{"$f":"+E88-SUM(E90:E96)","v":16095},17579.550000000003,19158.721499999992,20837.857395000006]
[" - Poistot"]
[{"$f":"+A51","v":"Maa- ja vesialueet"},null,{"$f":"+B69","v":20000},{"$f":"+C115-D115","v":0},{"$f":"+D115-E115","v":0},0,0,0]
[{"$f":"+A52","v":"Rakennukset ja rakennelmat"},null,{"$f":"+B70","v":120000},{"$f":"+C116-D116","v":5714.2857142857247},5442.1768707482988,5183.0255911888671,4936.2148487512895,4701.1569988107658]
[{"$f":"+A53","v":"Koneet ja kalusto"},null,{"$f":"+B71","v":40000},{"$f":"+C117-D117","v":5000},4375,3828.125,3349.609375,2930.908203125]
[{"$f":"+A54","v":"Aineeton käyttöomaisuus"},null,{"$f":"+B72","v":3000},{"$f":"+C118-D118","v":600},480,384,307.19999999999982,245.76]
[{"$f":"+A55","v":"Muu käyttöomaisuus"},null,{"$f":"+B73","v":1500},{"$f":"+C119-D119","v":300},240,192,153.59999999999991,122.88]
[" = Liiketulos",null,null,{"$f":"+D97-SUM(D99:D103)","v":3085.7142857142753},{"$f":"+E97-SUM(E99:E103)","v":5557.8231292517012},{"$f":"+F97-SUM(F99:F103)","v":7992.3994088111358},{"$f":"+G97-SUM(G99:G103)","v":10412.097276248702},{"$f":"+H97-SUM(H99:H103)","v":12837.152193064241}]
[" - Korkokulut",null,null,{"$f":"+D46","v":3260},{"$f":"+E46","v":3534.2},{"$f":"+F46","v":3413.8763102040812},{"$f":"+G46","v":3229.1332287140913},{"$f":"+H46","v":2983.6496336606829}]
[" - Verot",null,null,{"$f":"+IF((D104-D105)>0,$B$13*(D104-D105),0)","v":0},{"$f":"+IF((E104-E105)>0,$B$13*(E104-E105),0)","v":404.72462585034032},915.70461972141095,1436.5928095069221,1970.7005118807117]
["Tilikauden tulos",null,null,{"$f":"+D104-SUM(D105:D106)","v":-174.28571428572468},{"$f":"+E104-SUM(E105:E106)","v":1618.8985034013613},3662.8184788856433,5746.3712380276884,7882.8020475228468]
[]
["TASE-ENNUSTE (Euro)"]
[]
["Taseen omaisuus",null,null,"Ennusteet:"]
["Lyhytaikainen:",null,null,{"$f":"+D77","v":1},{"$f":"+E77","v":2},{"$f":"+F77","v":3},{"$f":"+G77","v":4},{"$f":"+H77","v":5}]
["Rahoitusomaisuus ja muu lyhytaikainen omaisuus",null,{"$f":"+K!F14","v":10000},{"$f":"+$B$18*D78-D62","v":7830},{"$f":"+$B$18*E78-E62","v":8221.5},{"$f":"+$B$18*F78-F62","v":8632.5750000000007},{"$f":"+$B$18*G78-G62","v":9064.2037500000006},{"$f":"+$B$18*H78-H62","v":10217.891238058461}]
["Pitkäaikainen:"]
[{"$f":"+A51","v":"Maa- ja vesialueet"},null,{"$f":"+B69","v":20000},{"$f":"+C115*(1-$C69)","v":20000},20000,20000,20000,20000]
[{"$f":"+A52","v":"Rakennukset ja rakennelmat"},null,{"$f":"+B70","v":120000},114285.71428571428,108843.53741496598,103660.51182377711,98724.29697502582,94023.139976215054]
[{"$f":"+A53","v":"Koneet ja kalusto"},null,{"$f":"+B71","v":40000},35000,30625,26796.875,23447.265625,20516.357421875]
[{"$f":"+A54","v":"Aineeton käyttöomaisuus"},null,{"$f":"+B72","v":3000},2400,1920,1536,1228.8000000000002,983.04000000000019]
[{"$f":"+A55","v":"Muu käyttöomaisuus"},null,{"$f":"+B73","v":1500},1200,960,768,614.40000000000009,491.5200000000001]
["Yhteensä",null,null,{"$f":"+D113+SUM(D115:D119)","v":180715.71428571426},{"$f":"+E113+SUM(E115:E119)","v":170570.03741496598},{"$f":"+F113+SUM(F115:F119)","v":161393.96182377712},{"$f":"+G113+SUM(G115:G119)","v":153078.96635002579},{"$f":"+H113+SUM(H115:H119)","v":146231.9486361485}]
[]
["Taseen pääoma"]
["Lyhytaikainen:"]
["Lyhytaikaiset velat (maks. voitto-osuus)",null,null,{"$f":"+D133","v":91.285714285713766},{"$f":"+E133","v":167.66635374149615},342.42395999870354,612.62132390015279,976.13036008128756]
["Muu lyhytaikainen vieras pääoma",null,{"$f":"+B59+K!F30","v":12000},{"$f":"+C125-D63","v":25640},{"$f":"+D125-E63","v":36954.210340136051},{"$f":"+E125-F63","v":43822.357623803036},{"$f":"+F125-G63","v":46711.88362202276},{"$f":"+G125-H63","v":46711.88362202276}]
["Pitkäaikainen:"]
["Pitkäaikainen vieras pääoma",null,{"$f":"+K!F31","v":145000},{"$f":"+C127+D60","v":138250},{"$f":"+D127+E60","v":115262.5},{"$f":"+E127+F60","v":95723.125},{"$f":"+F127+G60","v":79114.65625},{"$f":"+G127+H60","v":64997.457812499997}]
["Sijoitettu oma pääoma",null,{"$f":"+B61+K!F33","v":15000},{"$f":"+C128","v":15000},{"$f":"+D128+E61","v":15000},{"$f":"+E128+F61","v":15000},{"$f":"+F128+G61","v":15000},{"$f":"+G128+H61","v":15000}]
["Kertyneet voittovarat ja muu oma pääoma",null,{"$f":"+D107+K!F32","v":1825.7142857142753},{"$f":"+C129-D133","v":1734.4285714285616},{"$f":"+D129+E107-E133","v":3185.6607210884267},{"$f":"+E129+F107-F133","v":6506.0552399753669},{"$f":"+F129+G107-G133","v":11639.805154102902},{"$f":"+G129+H107-H133","v":18546.476841544463}]
["Yhteensä",null,null,{"$f":"+SUM(D124:D129)","v":180715.71428571426},170570.03741496598,161393.96182377709,153078.96635002582,146231.9486361485]
[]
["Lisätietoja:",null,null,"Laskettu:"]
["Osingot kertyneistä voitoista",{"$f":"+B16","v":0.05},null,{"$f":"+IF(C129-$B133*C129>0,$B133*C129,IF(C129>0,C129,0))","v":91.285714285713766},{"$f":"+IF(D129-$B133*D129+E107>0,$B133*(D129+E107),IF(D129+E107>0,D129+E107,0))","v":167.66635374149615},{"$f":"+IF(E129-$B133*E129+F107>0,$B133*(E129+F107),IF(E129+F107>0,E129+F107,0))","v":342.42395999870354},{"$f":"+IF(F129-$B133*F129+G107>0,$B133*(F129+G107),IF(F129+G107>0,F129+G107,0))","v":612.62132390015279},{"$f":"+IF(G129-$B133*G129+H107>0,$B133*(G129+H107),IF(G129+H107>0,G129+H107,0))","v":976.13036008128756}]
[]
[null,null,"Tarkistus",{"$f":"0.05*(D129+D124)","v":91.285714285713766},{"$f":"0.05*(E129+E124)","v":167.66635374149615},342.42395999870354,612.62132390015279,976.13036008128756]
[]
[]
["TILINPÄÄTÖKSEN TUNNUSLUVUT"]
[null,null,null,{"$f":"+D25","v":1},{"$f":"+E25","v":2},{"$f":"+F25","v":3},{"$f":"+G25","v":4},{"$f":"+H25","v":5}]
["Koko"]
["1. Liikevaihto (Euro)",null,null,{"$f":"+D78","v":156600},{"$f":"+E78","v":164430},{"$f":"+F78","v":172651.5},{"$f":"+G78","v":181284.07500000001},{"$f":"+H78","v":190348.27875}]
["2. Taseen loppusumma (Euro)",null,null,{"$f":"+D120","v":180715.71428571426},{"$f":"+E120","v":170570.03741496598},{"$f":"+F120","v":161393.96182377712},{"$f":"+G120","v":153078.96635002579},{"$f":"+H120","v":146231.9486361485}]
["3. Tilikauden tulos (Euro)",null,null,{"$f":"+D107","v":-174.28571428572468},{"$f":"+E107","v":1618.8985034013613},{"$f":"+F107","v":3662.8184788856433},{"$f":"+G107","v":5746.3712380276884},{"$f":"+H107","v":7882.8020475228468}]
["4. Voitto-osuus omistajalle (Euro)",null,null,{"$f":"+D133","v":91.285714285713766},{"$f":"+E133","v":167.66635374149615},342.42395999870354,612.62132390015279,976.13036008128756]
[]
["Kasvu"]
["1. Liikevaihdon kasvu-%",null,null,null,{"$f":"100*E78/D78-100","v":5},{"$f":"100*F78/E78-100","v":5},{"$f":"100*G78/F78-100","v":5},{"$f":"100*H78/G78-100","v":5}]
["2. Taseen loppusumman kasvu-%",null,null,null,{"$f":"100*E120/D120-100","v":-5.6141641643337294},{"$f":"100*F120/E120-100","v":-5.3796526812414953},{"$f":"100*G120/F120-100","v":-5.1519867161017459},{"$f":"100*H120/G120-100","v":-4.4728664408545171}]
["3. Tilikauden tuloksen kasvu-%",null,null,null,{"$f":"100*(E107)/(D107)-100","v":-1028.8761904761354},{"$f":"100*(F107)/(E107)-100","v":126.25374420878987},{"$f":"100*(G107)/(F107)-100","v":56.88386610345853},{"$f":"100*(H107)/(G107)-100","v":37.178781547508237}]
[]
["Kannattavuus"]
["1. Käyttökate / Liikevaihto (%)",null,null,{"$f":"100*D97/D78","v":9.3869731800766285},{"$f":"100*E97/E78","v":9.7883597883597879},{"$f":"100*F97/F78","v":10.182100937437557},{"$f":"100*G97/G78","v":10.56834225510431},{"$f":"100*H97/H78","v":10.947226595291713}]
["2. Liiketulos / Liikevaihto (%)",null,null,{"$f":"100*D104/D78","v":1.970443349753688},{"$f":"100*E104/E78","v":3.380054204981878},{"$f":"100*F104/F78","v":4.6292093661573377},{"$f":"100*G104/G78","v":5.7435256109775228},{"$f":"100*H104/H78","v":6.7440337666117403}]
["3. Tilikauden tulos / Liikevaihto (%)",null,null,{"$f":"100*D107/D78","v":-0.11129355956942828},{"$f":"100*E107/E78","v":0.98455178702266088},{"$f":"100*F107/F78","v":2.1215097922031627},{"$f":"100*G107/G78","v":3.169815792163591},{"$f":"100*H107/H78","v":4.141252077133819}]
["4. Sijoitetun pääoman tuotto-%",null,null,null,{"$f":"100*(E107+E106+E105)/D120","v":3.0754509375231751},{"$f":"100*(F107+F106+F105)/E120","v":4.6856995108508279},{"$f":"100*(G107+G106+G105)/F120","v":6.4513549073276142},{"$f":"100*(H107+H106+H105)/G120","v":8.385967386081763}]
["5. Oman pääoman tuotto-%",null,null,null,{"$f":"+IF(D128+D129>0,100*(E107)/(D128+D129),\"\")","v":9.6740590602859253},{"$f":"+IF(E128+E129>0,100*(F107)/(E128+E129),\"\")","v":20.141244990005625},26.71978274912248,29.590314200585606]
[]
["Maksuvalmius"]
["1. Rahoitustulos / Liikevaihto",null,null,{"$f":"100*(D107+SUM(D99:D103))/D78","v":7.3052362707535119},{"$f":"100*(E107+SUM(E99:E103))/E78","v":7.3928573704005709},{"$f":"100*(F107+SUM(F99:F103))/F78","v":7.6744013634833808},{"$f":"100*(G107+SUM(G99:G103))/G78","v":7.9946324362903791},{"$f":"100*(H107+SUM(H99:H103))/H78","v":8.3444449058137931}]
["2. Quick ratio",null,null,{"$f":"+(D113)/(D124+D125)","v":0.30429882466591529},{"$f":"+(E113)/(E124+E125)","v":0.22147317787292686},{"$f":"+(F113)/(F124+F125)","v":0.19546287087642156},{"$f":"+(G113)/(G124+G125)","v":0.1915329861423283},{"$f":"+(H113)/(H124+H125)","v":0.21426539679117154}]
[]
["Vakavaraisuus"]
["1. Omavaraisuusaste",null,null,{"$f":"100*(D128+D129)/D130","v":9.2600849005146166},{"$f":"100*(E128+E129)/E130","v":10.66169709328609},13.325191969360914,17.402655498201572,22.940593457462676]
["2. Rahoitustulos / Velat (%)",null,null,{"$f":"100*(D107+SUM(D99:D103))/(+D124+D125+D127)","v":6.9764058442209},{"$f":"100*(E107+SUM(E99:E103))/(+E124+E125+E127)","v":7.9772451992042459},{"$f":"100*(F107+SUM(F99:F103))/(+F124+F125+F127)","v":9.471847419588725},{"$f":"100*(G107+SUM(G99:G103))/(+G124+G125+G127)","v":11.462426138149921},{"$f":"100*(H107+SUM(H99:H103))/(+H124+H125+H127)","v":14.095434838672075}]
[]
["Rahoitusriski"]
["1. Kolmen muuttujan P-luku ","Kriittinen arvo P* = 0,50",null,{"$f":"1/(1+EXP(-(0.843-0.027*D163-0.039*D160-0.01*D159)))","v":0.62435104159514776},{"$f":"1/(1+EXP(-(0.843-0.027*E163-0.039*E160-0.01*E159)))","v":0.61599142285351272},{"$f":"1/(1+EXP(-(0.843-0.027*F163-0.039*F160-0.01*F159)))","v":0.59841199008606749},{"$f":"1/(1+EXP(-(0.843-0.027*G163-0.039*G160-0.01*G159)))","v":0.57094608368129884},{"$f":"1/(1+EXP(-(0.843-0.027*H163-0.039*H160-0.01*H159)))","v":0.53290317502239071}]
[null,"Tulkintalause",null,{"$f":"+IF(D167>0.65,\"Erittäin suuri riski\",IF(D167>0.45,\"Suuri riski\",IF(D167>0.25,\"Kohtuullinen riski\",IF(D167>0.1,\"Suhteellisen pieni riski\",\"Pieni riski\"))))","v":"Suuri riski"},{"$f":"+IF(E167>0.65,\"Erittäin suuri riski\",IF(E167>0.45,\"Suuri riski\",IF(E167>0.25,\"Kohtuullinen riski\",IF(E167>0.1,\"Suhteellisen pieni riski\",\"Pieni riski\"))))","v":"Suuri riski"},"Suuri riski","Suuri riski","Suuri riski"]

{"sheet":"T","index":2,"n_rows":159,"n_cols":15,"rows_kept":159,"cut":false,"hidden":true,"merged":[]}
[null," Copyright Vaasan Yritysinformaatio Oy. Kaikki tekijänoikeudet pidätetään."]
[]
[null,"ENNAKOITU TULOSLASKELMA"]
[null,null,"Ennakoidut viisi vuotta:"]
[null,null,1,2,3,4,5]
[null,{"$f":"+E!A78","v":"Liikevaihto"},{"$f":"+E!D78","v":156600},{"$f":"+E!E78","v":164430},{"$f":"+E!F78","v":172651.5},{"$f":"+E!G78","v":181284.07500000001},{"$f":"+E!H78","v":190348.27875}]
[null,{"$f":"+E!A79","v":" - Muuttuvat kulut"}]
[null,{"$f":"+E!A80","v":"Karkearehu"},{"$f":"+E!D80","v":21600},{"$f":"+E!E80","v":22680},{"$f":"+E!F80","v":23814},{"$f":"+E!G80","v":25004.7},{"$f":"+E!H80","v":26254.934999999998}]
[null,{"$f":"+E!A81","v":"Väkirehu"},{"$f":"+E!D81","v":8640.0000000000018},{"$f":"+E!E81","v":9072.0000000000018},{"$f":"+E!F81","v":9525.6},{"$f":"+E!G81","v":10001.880000000001},{"$f":"+E!H81","v":10501.974}]
[null,{"$f":"+E!A82","v":"Kivennäiset"},{"$f":"+E!D82","v":8640.0000000000018},{"$f":"+E!E82","v":9072.0000000000018},{"$f":"+E!F82","v":9525.6},{"$f":"+E!G82","v":10001.880000000001},{"$f":"+E!H82","v":10501.974}]
[null,{"$f":"+E!A83","v":"Muut ruokintakustannukset"},{"$f":"+E!D83","v":4320.0000000000009},{"$f":"+E!E83","v":4536.0000000000009},{"$f":"+E!F83","v":4762.8},{"$f":"+E!G83","v":5000.9400000000005},{"$f":"+E!H83","v":5250.9870000000001}]
[null,{"$f":"+E!A84","v":"Kuivikekustannukset"},{"$f":"+E!D84","v":10800},{"$f":"+E!E84","v":11340},{"$f":"+E!F84","v":11907},{"$f":"+E!G84","v":12502.35},{"$f":"+E!H84","v":13127.467499999999}]
[null,{"$f":"+E!A85","v":"Täyshoidon muuttuvat palkat lisineen"},{"$f":"+E!D85","v":21600},{"$f":"+E!E85","v":22680},{"$f":"+E!F85","v":23814},{"$f":"+E!G85","v":25004.7},{"$f":"+E!H85","v":26254.934999999998}]
[null,{"$f":"+E!A86","v":"Valmennuksen muuttuvat palkat lisineen"},{"$f":"+E!D86","v":32400},{"$f":"+E!E86","v":34020},{"$f":"+E!F86","v":35721},{"$f":"+E!G86","v":37507.050000000003},{"$f":"+E!H86","v":39382.402499999997}]
[null,{"$f":"+E!A87","v":"Muut muuttuvat kulut"},{"$f":"+E!D87","v":900},{"$f":"+E!E87","v":945},{"$f":"+E!F87","v":992.25},{"$f":"+E!G87","v":1041.8625},{"$f":"+E!H87","v":1093.9556250000001}]
[null,{"$f":"+E!A88","v":" = Myyntikate"},{"$f":"+E!D88","v":47700},{"$f":"+E!E88","v":50085},{"$f":"+E!F88","v":52589.25},{"$f":"+E!G88","v":55218.712499999994},{"$f":"+E!H88","v":57979.648125000007}]
[null,{"$f":"+E!A89","v":" - Kiinteät kulut"}]
[null,{"$f":"+E!A90","v":"Vuokrakulut"},{"$f":"+E!D90","v":0},{"$f":"+E!E90","v":0},{"$f":"+E!F90","v":0},{"$f":"+E!G90","v":0},{"$f":"+E!H90","v":0}]
[null,{"$f":"+E!A91","v":"Sähkökulut"},{"$f":"+E!D91","v":2400},{"$f":"+E!E91","v":2472},{"$f":"+E!F91","v":2546.16},{"$f":"+E!G91","v":2622.5448000000001},{"$f":"+E!H91","v":2701.2211439999996}]
[null,{"$f":"+E!A92","v":"Vesikulut"},{"$f":"+E!D92","v":1200},{"$f":"+E!E92","v":1236},{"$f":"+E!F92","v":1273.08},{"$f":"+E!G92","v":1311.2724000000001},{"$f":"+E!H92","v":1350.6105719999998}]
[null,{"$f":"+E!A93","v":"Pohjien huolto"},{"$f":"+E!D93","v":3000},{"$f":"+E!E93","v":3090},{"$f":"+E!F93","v":3182.7},{"$f":"+E!G93","v":3278.181},{"$f":"+E!H93","v":3376.5264299999999}]
[null,{"$f":"+E!A94","v":"Lantalan tyhjennys"},{"$f":"+E!D94","v":1200},{"$f":"+E!E94","v":1236},{"$f":"+E!F94","v":1273.08},{"$f":"+E!G94","v":1311.2724000000001},{"$f":"+E!H94","v":1350.6105719999998}]
[null,{"$f":"+E!A95","v":"Kiinteät palkkakustannukset lisineen"},{"$f":"+E!D95","v":24000},{"$f":"+E!E95","v":24720},{"$f":"+E!F95","v":25461.599999999999},{"$f":"+E!G95","v":26225.448},{"$f":"+E!H95","v":27012.211439999999}]
[null,"Muut kiinteät kulut",{"$f":"+E!D96","v":1200},{"$f":"+E!E96","v":1236},{"$f":"+E!F96","v":1273.08},{"$f":"+E!G96","v":1311.2724000000001},{"$f":"+E!H96","v":1350.6105719999998}]
[null,{"$f":"+E!A97","v":" = Käyttökate"},{"$f":"+E!D97","v":14700},{"$f":"+E!E97","v":16095},{"$f":"+E!F97","v":17579.550000000003},{"$f":"+E!G97","v":19158.721499999992},{"$f":"+E!H97","v":20837.857395000006}]
[null,{"$f":"+E!A98","v":" - Poistot"}]
[null,{"$f":"+E!A99","v":"Maa- ja vesialueet"},{"$f":"+E!D99","v":0},{"$f":"+E!E99","v":0},{"$f":"+E!F99","v":0},{"$f":"+E!G99","v":0},{"$f":"+E!H99","v":0}]
[null,{"$f":"+E!A100","v":"Rakennukset ja rakennelmat"},{"$f":"+E!D100","v":5714.2857142857247},{"$f":"+E!E100","v":5442.1768707482988},{"$f":"+E!F100","v":5183.0255911888671},{"$f":"+E!G100","v":4936.2148487512895},{"$f":"+E!H100","v":4701.1569988107658}]
[null,{"$f":"+E!A101","v":"Koneet ja kalusto"},{"$f":"+E!D101","v":5000},{"$f":"+E!E101","v":4375},{"$f":"+E!F101","v":3828.125},{"$f":"+E!G101","v":3349.609375},{"$f":"+E!H101","v":2930.908203125}]
[null,{"$f":"+E!A102","v":"Aineeton käyttöomaisuus"},{"$f":"+E!D102","v":600},{"$f":"+E!E102","v":480},{"$f":"+E!F102","v":384},{"$f":"+E!G102","v":307.19999999999982},{"$f":"+E!H102","v":245.76}]
[null,{"$f":"+E!A103","v":"Muu käyttöomaisuus"},{"$f":"+E!D103","v":300},{"$f":"+E!E103","v":240},{"$f":"+E!F103","v":192},{"$f":"+E!G103","v":153.59999999999991},{"$f":"+E!H103","v":122.88}]
[null,{"$f":"+E!A104","v":" = Liiketulos"},{"$f":"+E!D104","v":3085.7142857142753},{"$f":"+E!E104","v":5557.8231292517012},{"$f":"+E!F104","v":7992.3994088111358},{"$f":"+E!G104","v":10412.097276248702},{"$f":"+E!H104","v":12837.152193064241}]
[null,{"$f":"+E!A105","v":" - Korkokulut"},{"$f":"+E!D105","v":3260},{"$f":"+E!E105","v":3534.2},{"$f":"+E!F105","v":3413.8763102040812},{"$f":"+E!G105","v":3229.1332287140913},{"$f":"+E!H105","v":2983.6496336606829}]
[null,{"$f":"+E!A106","v":" - Verot"},{"$f":"+E!D106","v":0},{"$f":"+E!E106","v":404.72462585034032},{"$f":"+E!F106","v":915.70461972141095},{"$f":"+E!G106","v":1436.5928095069221},{"$f":"+E!H106","v":1970.7005118807117}]
[null,{"$f":"+E!A107","v":"Tilikauden tulos"},{"$f":"+E!D107","v":-174.28571428572468},{"$f":"+E!E107","v":1618.8985034013613},{"$f":"+E!F107","v":3662.8184788856433},{"$f":"+E!G107","v":5746.3712380276884},{"$f":"+E!H107","v":7882.8020475228468}]
[]
[null,"ENNAKOITU TASE"]
[null,null,{"$f":"+C4","v":"Ennakoidut viisi vuotta:"}]
[null,null,1,2,3,4,5]
[null,{"$f":"+E!A111","v":"Taseen omaisuus"}]
[null,{"$f":"+E!A112","v":"Lyhytaikainen:"}]
[null,{"$f":"+E!A113","v":"Rahoitusomaisuus ja muu lyhytaikainen omaisuus"},{"$f":"+E!D113","v":7830},{"$f":"+E!E113","v":8221.5},{"$f":"+E!F113","v":8632.5750000000007},{"$f":"+E!G113","v":9064.2037500000006},{"$f":"+E!H113","v":10217.891238058461}]
[null,{"$f":"+E!A114","v":"Pitkäaikainen:"}]
[null,{"$f":"+E!A115","v":"Maa- ja vesialueet"},{"$f":"+E!D115","v":20000},{"$f":"+E!E115","v":20000},{"$f":"+E!F115","v":20000},{"$f":"+E!G115","v":20000},{"$f":"+E!H115","v":20000}]
[null,{"$f":"+E!A116","v":"Rakennukset ja rakennelmat"},{"$f":"+E!D116","v":114285.71428571428},{"$f":"+E!E116","v":108843.53741496598},{"$f":"+E!F116","v":103660.51182377711},{"$f":"+E!G116","v":98724.29697502582},{"$f":"+E!H116","v":94023.139976215054}]
[null,{"$f":"+E!A117","v":"Koneet ja kalusto"},{"$f":"+E!D117","v":35000},{"$f":"+E!E117","v":30625},{"$f":"+E!F117","v":26796.875},{"$f":"+E!G117","v":23447.265625},{"$f":"+E!H117","v":20516.357421875}]
[null,{"$f":"+E!A118","v":"Aineeton käyttöomaisuus"},{"$f":"+E!D118","v":2400},{"$f":"+E!E118","v":1920},{"$f":"+E!F118","v":1536},{"$f":"+E!G118","v":1228.8000000000002},{"$f":"+E!H118","v":983.04000000000019}]
[null,{"$f":"+E!A119","v":"Muu käyttöomaisuus"},{"$f":"+E!D119","v":1200},{"$f":"+E!E119","v":960},{"$f":"+E!F119","v":768},{"$f":"+E!G119","v":614.40000000000009},{"$f":"+E!H119","v":491.5200000000001}]
[null,{"$f":"+E!A120","v":"Yhteensä"},{"$f":"+E!D120","v":180715.71428571426},{"$f":"+E!E120","v":170570.03741496598},{"$f":"+E!F120","v":161393.96182377712},{"$f":"+E!G120","v":153078.96635002579},{"$f":"+E!H120","v":146231.9486361485}]
[]
[null,{"$f":"+E!A122","v":"Taseen pääoma"}]
[null,{"$f":"+E!A123","v":"Lyhytaikainen:"}]
[null,{"$f":"+E!A124","v":"Lyhytaikaiset velat (maks. voitto-osuus)"},{"$f":"+E!D124","v":91.285714285713766},{"$f":"+E!E124","v":167.66635374149615},{"$f":"+E!F124","v":342.42395999870354},{"$f":"+E!G124","v":612.62132390015279},{"$f":"+E!H124","v":976.13036008128756}]
[null,{"$f":"+E!A125","v":"Muu lyhytaikainen vieras pääoma"},{"$f":"+E!D125","v":25640},{"$f":"+E!E125","v":36954.210340136051},{"$f":"+E!F125","v":43822.357623803036},{"$f":"+E!G125","v":46711.88362202276},{"$f":"+E!H125","v":46711.88362202276}]
[null,{"$f":"+E!A126","v":"Pitkäaikainen:"}]
[null,{"$f":"+E!A127","v":"Pitkäaikainen vieras pääoma"},{"$f":"+E!D127","v":138250},{"$f":"+E!E127","v":115262.5},{"$f":"+E!F127","v":95723.125},{"$f":"+E!G127","v":79114.65625},{"$f":"+E!H127","v":64997.457812499997}]
[null,{"$f":"+E!A128","v":"Sijoitettu oma pääoma"},{"$f":"+E!D128","v":15000},{"$f":"+E!E128","v":15000},{"$f":"+E!F128","v":15000},{"$f":"+E!G128","v":15000},{"$f":"+E!H128","v":15000}]
[null,{"$f":"+E!A129","v":"Kertyneet voittovarat ja muu oma pääoma"},{"$f":"+E!D129","v":1734.4285714285616},{"$f":"+E!E129","v":3185.6607210884267},{"$f":"+E!F129","v":6506.0552399753669},{"$f":"+E!G129","v":11639.805154102902},{"$f":"+E!H129","v":18546.476841544463}]
[null,{"$f":"+E!A130","v":"Yhteensä"},{"$f":"+E!D130","v":180715.71428571426},{"$f":"+E!E130","v":170570.03741496598},{"$f":"+E!F130","v":161393.96182377709},{"$f":"+E!G130","v":153078.96635002582},{"$f":"+E!H130","v":146231.9486361485}]
[]
[null,"ENNAKOIDUT TUNNUSLUVUT"]
[null,null,{"$f":"+C4","v":"Ennakoidut viisi vuotta:"}]
[null,null,{"$f":"+E!D139","v":1},{"$f":"+E!E139","v":2},{"$f":"+E!F139","v":3},{"$f":"+E!G139","v":4},{"$f":"+E!H139","v":5}]
[null,"Koko"]
[null,{"$f":"+E!A141","v":"1. Liikevaihto (Euro)"},{"$f":"+E!D141","v":156600},{"$f":"+E!E141","v":164430},{"$f":"+E!F141","v":172651.5},{"$f":"+E!G141","v":181284.07500000001},{"$f":"+E!H141","v":190348.27875}]
[null,{"$f":"+E!A142","v":"2. Taseen loppusumma (Euro)"},{"$f":"+E!D142","v":180715.71428571426},{"$f":"+E!E142","v":170570.03741496598},{"$f":"+E!F142","v":161393.96182377712},{"$f":"+E!G142","v":153078.96635002579},{"$f":"+E!H142","v":146231.9486361485}]
[null,{"$f":"+E!A143","v":"3. Tilikauden tulos (Euro)"},{"$f":"+E!D143","v":-174.28571428572468},{"$f":"+E!E143","v":1618.8985034013613},{"$f":"+E!F143","v":3662.8184788856433},{"$f":"+E!G143","v":5746.3712380276884},{"$f":"+E!H143","v":7882.8020475228468}]
[null,{"$f":"+E!A144","v":"4. Voitto-osuus omistajalle (Euro)"},{"$f":"+E!D144","v":91.285714285713766},{"$f":"+E!E144","v":167.66635374149615},{"$f":"+E!F144","v":342.42395999870354},{"$f":"+E!G144","v":612.62132390015279},{"$f":"+E!H144","v":976.13036008128756}]
[]
[null,{"$f":"+E!A146","v":"Kasvu"}]
[null,{"$f":"+E!A147","v":"1. Liikevaihdon kasvu-%"},null,{"$f":"+E!E147","v":5},{"$f":"+E!F147","v":5},{"$f":"+E!G147","v":5},{"$f":"+E!H147","v":5}]
[null,{"$f":"+E!A148","v":"2. Taseen loppusumman kasvu-%"},null,{"$f":"+E!E148","v":-5.6141641643337294},{"$f":"+E!F148","v":-5.3796526812414953},{"$f":"+E!G148","v":-5.1519867161017459},{"$f":"+E!H148","v":-4.4728664408545171}]
[null,{"$f":"+E!A149","v":"3. Tilikauden tuloksen kasvu-%"},null,{"$f":"+E!E149","v":-1028.8761904761354},{"$f":"+E!F149","v":126.25374420878987},{"$f":"+E!G149","v":56.88386610345853},{"$f":"+E!H149","v":37.178781547508237}]
[]
[null,{"$f":"+E!A151","v":"Kannattavuus"}]
[null,{"$f":"+E!A152","v":"1. Käyttökate / Liikevaihto (%)"},{"$f":"+E!D152","v":9.3869731800766285},{"$f":"+E!E152","v":9.7883597883597879},{"$f":"+E!F152","v":10.182100937437557},{"$f":"+E!G152","v":10.56834225510431},{"$f":"+E!H152","v":10.947226595291713}]
[null,{"$f":"+E!A153","v":"2. Liiketulos / Liikevaihto (%)"},{"$f":"+E!D153","v":1.970443349753688},{"$f":"+E!E153","v":3.380054204981878},{"$f":"+E!F153","v":4.6292093661573377},{"$f":"+E!G153","v":5.7435256109775228},{"$f":"+E!H153","v":6.7440337666117403}]
[null,{"$f":"+E!A154","v":"3. Tilikauden tulos / Liikevaihto (%)"},{"$f":"+E!D154","v":-0.11129355956942828},{"$f":"+E!E154","v":0.98455178702266088},{"$f":"+E!F154","v":2.1215097922031627},{"$f":"+E!G154","v":3.169815792163591},{"$f":"+E!H154","v":4.141252077133819}]
[null,{"$f":"+E!A155","v":"4. Sijoitetun pääoman tuotto-%"},null,{"$f":"+E!E155","v":3.0754509375231751},{"$f":"+E!F155","v":4.6856995108508279},{"$f":"+E!G155","v":6.4513549073276142},{"$f":"+E!H155","v":8.385967386081763}]
[null,{"$f":"+E!A156","v":"5. Oman pääoman tuotto-%"},null,{"$f":"+E!E156","v":9.6740590602859253},{"$f":"+E!F156","v":20.141244990005625},{"$f":"+E!G156","v":26.71978274912248},{"$f":"+E!H156","v":29.590314200585606}]
[]
[null,{"$f":"+E!A158","v":"Maksuvalmius"}]
[null,{"$f":"+E!A159","v":"1. Rahoitustulos / Liikevaihto"},{"$f":"+E!D159","v":7.3052362707535119},{"$f":"+E!E159","v":7.3928573704005709},{"$f":"+E!F159","v":7.6744013634833808},{"$f":"+E!G159","v":7.9946324362903791},{"$f":"+E!H159","v":8.3444449058137931}]
[null,{"$f":"+E!A160","v":"2. Quick ratio"},{"$f":"+E!D160","v":0.30429882466591529},{"$f":"+E!E160","v":0.22147317787292686},{"$f":"+E!F160","v":0.19546287087642156},{"$f":"+E!G160","v":0.1915329861423283},{"$f":"+E!H160","v":0.21426539679117154}]
[]
[null,{"$f":"+E!A162","v":"Vakavaraisuus"}]
[null,{"$f":"+E!A163","v":"1. Omavaraisuusaste"},{"$f":"+E!D163","v":9.2600849005146166},{"$f":"+E!E163","v":10.66169709328609},{"$f":"+E!F163","v":13.325191969360914},{"$f":"+E!G163","v":17.402655498201572},{"$f":"+E!H163","v":22.940593457462676}]
[null,{"$f":"+E!A164","v":"2. Rahoitustulos / Velat (%)"},{"$f":"+E!D164","v":6.9764058442209},{"$f":"+E!E164","v":7.9772451992042459},{"$f":"+E!F164","v":9.471847419588725},{"$f":"+E!G164","v":11.462426138149921},{"$f":"+E!H164","v":14.095434838672075}]
[]
[null,"Rahoitusriski: Taipumus kuulua konkurssiyritysten (1) tai toimivien yritysten (0) joukkoon"]
[null,{"$f":"+E!A167","v":"1. Kolmen muuttujan P-luku "},{"$f":"+E!D167","v":0.62435104159514776},{"$f":"+E!E167","v":0.61599142285351272},{"$f":"+E!F167","v":0.59841199008606749},{"$f":"+E!G167","v":0.57094608368129884},{"$f":"+E!H167","v":0.53290317502239071}]
[]
[]
[null,"TULKINTARAPORTTI"]
[]
[null,null,{"$f":"+C4","v":"Ennakoidut viisi vuotta:"}]
[null,null,1,2,3,4,5]
[null,"Kannattavuus"]
[null,"Käyttökate / Myyntituotot (%)",{"$f":"+IF(C76>0,\"Positiivinen\",\"Negatiivinen\")","v":"Positiivinen"},{"$f":"+IF(D76>0,\"Positiivinen\",\"Negatiivinen\")","v":"Positiivinen"},{"$f":"+IF(E76>0,\"Positiivinen\",\"Negatiivinen\")","v":"Positiivinen"},{"$f":"+IF(F76>0,\"Positiivinen\",\"Negatiivinen\")","v":"Positiivinen"},{"$f":"+IF(G76>0,\"Positiivinen\",\"Negatiivinen\")","v":"Positiivinen"}]
[null,"Sijoitetun pääoman tuotto-%",null,{"$f":"+IF(D79>15,\"Erinomainen\",IF(D79>10,\"Hyvä\",IF(D79>6,\"Tyydyttävä\",IF(D79>3,\"Välttävä\",\"Heikko\"))))","v":"Välttävä"},{"$f":"+IF(E79>15,\"Erinomainen\",IF(E79>10,\"Hyvä\",IF(E79>6,\"Tyydyttävä\",IF(E79>3,\"Välttävä\",\"Heikko\"))))","v":"Välttävä"},{"$f":"+IF(F79>15,\"Erinomainen\",IF(F79>10,\"Hyvä\",IF(F79>6,\"Tyydyttävä\",IF(F79>3,\"Välttävä\",\"Heikko\"))))","v":"Tyydyttävä"},{"$f":"+IF(G79>15,\"Erinomainen\",IF(G79>10,\"Hyvä\",IF(G79>6,\"Tyydyttävä\",IF(G79>3,\"Välttävä\",\"Heikko\"))))","v":"Tyydyttävä"}]
[null,"Oman pääoman tuotto-%",null,{"$f":"+IF(D80=\"\",\"\",IF(D80>20,\"Erinomainen\",IF(D80>15,\"Hyvä\",IF(D80>10,\"Tyydyttävä\",IF(D80>5,\"Välttävä\",\"Heikko\")))))","v":"Välttävä"},{"$f":"+IF(E80=\"\",\"\",IF(E80>20,\"Erinomainen\",IF(E80>15,\"Hyvä\",IF(E80>10,\"Tyydyttävä\",IF(E80>5,\"Välttävä\",\"Heikko\")))))","v":"Erinomainen"},"Erinomainen","Erinomainen"]
[]
[null,"Maksuvalmius"]
[null,"Rahoitustulos / Myyntituotot",{"$f":"+IF(C83>0,\"Positiivinen\",\"Negatiivinen\")","v":"Positiivinen"},{"$f":"+IF(D83>0,\"Positiivinen\",\"Negatiivinen\")","v":"Positiivinen"},{"$f":"+IF(E83>0,\"Positiivinen\",\"Negatiivinen\")","v":"Positiivinen"},{"$f":"+IF(F83>0,\"Positiivinen\",\"Negatiivinen\")","v":"Positiivinen"},{"$f":"+IF(G83>0,\"Positiivinen\",\"Negatiivinen\")","v":"Positiivinen"}]
[null,"Quick ratio",{"$f":"+IF(C84>1.5,\"Erinomainen\",IF(C84>1,\"Hyvä\",IF(C84>0.5,\"Tyydyttävä\",IF(C84>0.3,\"Välttävä\",\"Heikko\"))))","v":"Välttävä"},{"$f":"+IF(D84>1.5,\"Erinomainen\",IF(D84>1,\"Hyvä\",IF(D84>0.5,\"Tyydyttävä\",IF(D84>0.3,\"Välttävä\",\"Heikko\"))))","v":"Heikko"},{"$f":"+IF(E84>1.5,\"Erinomainen\",IF(E84>1,\"Hyvä\",IF(E84>0.5,\"Tyydyttävä\",IF(E84>0.3,\"Välttävä\",\"Heikko\"))))","v":"Heikko"},{"$f":"+IF(F84>1.5,\"Erinomainen\",IF(F84>1,\"Hyvä\",IF(F84>0.5,\"Tyydyttävä\",IF(F84>0.3,\"Välttävä\",\"Heikko\"))))","v":"Heikko"},{"$f":"+IF(G84>1.5,\"Erinomainen\",IF(G84>1,\"Hyvä\",IF(G84>0.5,\"Tyydyttävä\",IF(G84>0.3,\"Välttävä\",\"Heikko\"))))","v":"Heikko"}]
[]
[null,"Vakavaraisuus"]
[null,"Omavaraisuusaste",{"$f":"+IF(C87>50,\"Erinomainen\",IF(C87>35,\"Hyvä\",IF(C87>25,\"Tyydyttävä\",IF(C87>15,\"Välttävä\",\"Heikko\"))))","v":"Heikko"},{"$f":"+IF(D87>50,\"Erinomainen\",IF(D87>35,\"Hyvä\",IF(D87>25,\"Tyydyttävä\",IF(D87>15,\"Välttävä\",\"Heikko\"))))","v":"Heikko"},"Heikko","Välttävä","Välttävä"]
[null,"Rahoitustulos / Velat (%)",{"$f":"+IF(1/(C88/100)<1,\"Erinomainen\",IF(1/(C88/100)<3,\"Hyvä\",IF(1/(C88/100)<5,\"Tyydyttävä\",IF(1/(C88/100)<10,\"Välttävä\",\"Heikko\"))))","v":"Heikko"},{"$f":"+IF(1/(D88/100)<1,\"Erinomainen\",IF(1/(D88/100)<3,\"Hyvä\",IF(1/(D88/100)<5,\"Tyydyttävä\",IF(1/(D88/100)<10,\"Välttävä\",\"Heikko\"))))","v":"Heikko"},"Heikko","Välttävä","Välttävä"]
[]
[null,"Rahoitusriski"]
[null,"Kolmen muuttujan P-luku",{"$f":"+IF(C91>0.65,\"Erittäin suuri riski\",IF(C91>0.45,\"Suuri riski\",IF(C91>0.25,\"Kohtuullinen riski\",IF(C91>0.1,\"Suhteellisen pieni riski\",\"Pieni riski\"))))","v":"Suuri riski"},{"$f":"+IF(D91>0.65,\"Erittäin suuri riski\",IF(D91>0.45,\"Suuri riski\",IF(D91>0.25,\"Kohtuullinen riski\",IF(D91>0.1,\"Suhteellisen pieni riski\",\"Pieni riski\"))))","v":"Suuri riski"},"Suuri riski","Suuri riski","Suuri riski"]
[]
[]
[null,"LIITEKUVIOT"]
[null,null,null,null,null,null,null,null,null,"Vuosi",1,2,3,4,5]
[null,null,null,null,null,null,null,null,null,"Käyttökate",{"$f":"+C25","v":14700},{"$f":"+D25","v":16095},{"$f":"+E25","v":17579.550000000003},{"$f":"+F25","v":19158.721499999992},{"$f":"+G25","v":20837.857395000006}]
[null,null,null,null,null,null,null,null,null,"Liiketulos",{"$f":"+C32","v":3085.7142857142753},{"$f":"+D32","v":5557.8231292517012},{"$f":"+E32","v":7992.3994088111358},{"$f":"+F32","v":10412.097276248702},{"$f":"+G32","v":12837.152193064241}]
[null,null,null,null,null,null,null,null,null,"Tilikauden tulos",{"$f":"+C35","v":-174.28571428572468},{"$f":"+D35","v":1618.8985034013613},{"$f":"+E35","v":3662.8184788856433},{"$f":"+F35","v":5746.3712380276884},{"$f":"+G35","v":7882.8020475228468}]
[]
[]
[]
[]
[]
[]
[]
[]
[]
[]
[]
[]
[]
[]
[]
[]
[]
[null,null,null,null,null,null,null,null,null,"Vuosi",1,2,3,4,5]
[null,null,null,null,null,null,null,null,null,"Sijoitetun pääoman tuotto-%",null,{"$f":"+D79","v":3.0754509375231751},{"$f":"+E79","v":4.6856995108508279},{"$f":"+F79","v":6.4513549073276142},{"$f":"+G79","v":8.385967386081763}]
[null,null,null,null,null,null,null,null,null,"Quick ratio",{"$f":"+C84","v":0.30429882466591529},{"$f":"+D84","v":0.22147317787292686},{"$f":"+E84","v":0.19546287087642156},{"$f":"+F84","v":0.1915329861423283},{"$f":"+G84","v":0.21426539679117154}]
[null,null,null,null,null,null,null,null,null,"Omavaraisuusaste",{"$f":"+C87","v":9.2600849005146166},10.66169709328609,13.325191969360914,17.402655498201572,22.940593457462676]
[]
[]
[]
[]
[]
[]
[]
[]
[]
[]
[]
[]
[]
[]
[]
[]
[null,null,null,null,null,null,null,null,null,"Vuosi",1,2,3,4,5]
[null,null,null,null,null,null,null,null,null,"Rahoitusriski",{"$f":"+C91","v":0.62435104159514776},{"$f":"+D91","v":0.61599142285351272},0.59841199008606749,0.57094608368129884,0.53290317502239071]
[null,null,null,null,null,null,null,null,null,"Kriittinen taso",0.5,0.5,0.5,0.5,0.5]